program: Orca
programVersion: 5.0.2
elementType: S P O O O O N N C C C C C C C C C C C C C H H H H H H H H H H H H H H H H H H H H H
charge: 0
multiplicity: 1
keywords: wb97x-d3
keywords: def2-TZVPP
keywords: def2/J RIJCOSX
keywords: DEFGRID2
keywords: scfconv7
keywords: smallprint printgap noloewdin
keywords: NOSOSCF
formula: C13H21N2O4PS
InChI: InChI=1/C13H21N2O4PS/c1-5-11(4)14-20(21,18-6-2)19-13-9-10(3)7-8-12(13)15(16)17/h7-9,11,14H,5-6H2,1-4H3
42 atoms
S  0.295229 2.068898 1.82439
P  0.821112 0.583126 0.717089
O  -0.159257 -0.740384 0.781202
O  0.759515 0.826408 -0.86939
O  0.024992 -2.18185 -1.559754
O  -0.897677 -0.997093 -3.078169
N  2.251071 -0.08876 1.125177
N  -0.811653 -1.39594 -1.93872
C  2.965966 -1.128937 0.37744
C  3.920765 -0.545532 -0.666181
C  3.665171 -2.050817 1.36405
C  5.030675 0.329434 -0.103447
C  -1.447109 -0.649728 0.336717
C  0.646773 2.127211 -1.479106
C  -1.791766 -0.92928 -0.98613
C  -2.433908 -0.241031 1.215159
C  -3.760339 -0.124632 0.80778
C  -3.101036 -0.783277 -1.417624
C  -4.077098 -0.391443 -0.522092
C  -0.791535 2.460712 -1.778674
C  -4.817716 0.263223 1.791049
H  2.218921 -1.718456 -0.155503
H  3.339254 0.025752 -1.392831
H  4.357934 -1.381439 -1.218811
H  2.814553 0.464324 1.757174
H  2.942995 -2.5480 2.011135
H  4.365424 -1.506743 2.000145
H  4.226367 -2.819794 0.832281
H  5.699098 -0.225973 0.55507
H  5.639235 0.737546 -0.910755
H  4.637656 1.177881 0.459714
H  1.236315 2.073471 -2.392406
H  1.097685 2.883273 -0.835981
H  -2.157496 -0.017044 2.237589
H  -3.363792 -0.997534 -2.444381
H  -5.099791 -0.298231 -0.862625
H  -0.838862 3.444106 -2.248013
H  -1.391263 2.495491 -0.869495
H  -1.23731 1.743015 -2.466109
H  -5.711862 0.632234 1.292005
H  -4.462304 1.030903 2.477364
H  -5.109564 -0.598212 2.394894
elementType: S P O N C H
totalener: -1658.11182772 hartree
nucrepener: 2232.32100766 hartree
electener: -3890.43283538 hartree
oneelecener: -6715.36414870 hartree
twoeener: 2824.93131332 hartree
cpcmener: -0.02820228 hartree
kineticenergy: 1652.74020635 hartree
xcener: -123.703498036955 hartree
chargesum: -0.0000000
charge: -0.457909 0.618610 -0.363615 -0.351305 -0.389469 -0.389426 -0.251818 0.569564 0.107091 -0.121727 -0.299524 -0.274105 0.244621 0.046424 0.004434 -0.151628 -0.003965 -0.151718 -0.122641 -0.238259 -0.195431 0.100560 0.068326 0.073380 0.166846 0.097409 0.095758 0.093158 0.084402 0.095442 0.074761 0.108392 0.092350 0.129264 0.158811 0.150290 0.110288 0.073750 0.086144 0.098484 0.103461 0.110522
qa: -0.4579 0.6186 -0.3636 -0.3513 -0.3895 -0.3894 -0.2518 0.5696 0.1071 -0.1217 -0.2995 -0.2741 0.2446 0.0464 0.0044 -0.1516 -0.0040 -0.1517 -0.1226 -0.2383 -0.1954 0.1006 0.0683 0.0734 0.1668 0.0974 0.0958 0.0932 0.0844 0.0954 0.0748 0.1084 0.0924 0.1293 0.1588 0.1503 0.1103 0.0737 0.0861 0.0985 0.1035 0.1105
va: 1.9966 5.5124 2.0824 2.0299 1.8392 1.8499 3.1533 4.0568 3.8453 3.8908 3.9621 3.9332 3.8824 3.8119 3.7881 3.9906 3.7971 4.0142 3.9196 3.9073 3.8914 1.0052 1.0153 1.0131 1.0241 1.0097 0.9970 1.0034 0.9979 1.0041 1.0096 0.9932 1.0174 1.0219 1.0090 0.9963 1.0105 1.0188 1.0107 1.0036 0.9994 0.9945
dispcorr: -0.024514686 hartree
energy: -1658.136342404415
dipole: 12.09947 -12.82798 -0.72851 3.74808 -3.32070 0.42738 0.50683 -0.24540 0.26144
magnitude: 0.88416 au
magnitude: 2.24734 debye
