program: Orca
programVersion: 5.0.2
elementType: S P O O O O N N C C C C C C C C C C C C C H H H H H H H H H H H H H H H H H H H H H
charge: 0
multiplicity: 1
keywords: wb97x-d3
keywords: def2-TZVPP
keywords: def2/J RIJCOSX
keywords: DEFGRID2
keywords: scfconv7
keywords: smallprint printgap noloewdin
keywords: NOSOSCF
formula: C13H21N2O4PS
InChI: InChI=1/C13H21N2O4PS/c1-5-11(4)14-20(21,18-6-2)19-13-9-10(3)7-8-12(13)15(16)17/h7-9,11,14H,5-6H2,1-4H3
42 atoms
S  0.034426 2.10453 1.777468
P  0.68664 0.604817 0.761419
O  -0.266538 -0.74354 0.853606
O  0.693452 0.756379 -0.833872
O  -0.796785 -1.145572 -2.992609
O  0.054912 -2.28824 -1.400584
N  2.160702 0.060985 1.198203
N  -0.771333 -1.525294 -1.844365
C  2.876309 -1.074089 0.604981
C  4.359606 -0.738838 0.480807
C  2.665218 -2.343709 1.415222
C  4.658767 0.452063 -0.413328
C  -1.537318 -0.710309 0.361578
C  0.597838 2.021468 -1.517008
C  -1.814694 -1.05723 -0.960832
C  -2.571927 -0.290738 1.176401
C  -3.881012 -0.22733 0.704832
C  -3.106221 -0.974535 -1.455609
C  -4.132023 -0.570226 -0.621214
C  1.908476 2.765691 -1.537899
C  -4.982519 0.203828 1.619928
H  2.478454 -1.223078 -0.401442
H  4.866207 -1.625362 0.090497
H  4.770195 -0.570159 1.482191
H  2.447958 0.305981 2.137696
H  3.044981 -2.221381 2.431881
H  3.19649 -3.180195 0.960148
H  1.611601 -2.613024 1.478561
H  5.734776 0.60303 -0.51002
H  4.258446 0.303292 -1.41825
H  4.234414 1.374999 -0.018368
H  -0.187862 2.62253 -1.056346
H  0.277134 1.766833 -2.526139
H  -2.346989 -0.007976 2.196878
H  -3.317203 -1.245708 -2.480958
H  -5.140953 -0.523669 -1.008979
H  2.696098 2.18003 -2.011139
H  2.233105 3.046434 -0.535721
H  1.782692 3.683635 -2.113306
H  -4.720643 1.122096 2.14575
H  -5.172428 -0.556583 2.379333
H  -5.910754 0.373004 1.077424
elementType: S P O N C H
totalener: -1658.11281874 hartree
nucrepener: 2227.20159147 hartree
electener: -3885.31441020 hartree
oneelecener: -6705.26561091 hartree
twoeener: 2819.95120070 hartree
cpcmener: -0.02790614 hartree
kineticenergy: 1652.74179506 hartree
xcener: -123.701619539003 hartree
chargesum: -0.0000000
charge: -0.455514 0.607227 -0.364994 -0.353088 -0.389266 -0.387993 -0.219777 0.547239 0.099919 -0.084378 -0.288857 -0.297563 0.235193 0.062714 0.045410 -0.151988 -0.005991 -0.156892 -0.128545 -0.254204 -0.195475 0.072566 0.067086 0.069461 0.161459 0.092068 0.092630 0.090683 0.101771 0.084512 0.077460 0.092260 0.099329 0.131762 0.161659 0.149918 0.091365 0.081281 0.107915 0.105648 0.109961 0.096028
qa: -0.4555 0.6072 -0.3650 -0.3531 -0.3893 -0.3880 -0.2198 0.5472 0.0999 -0.0844 -0.2889 -0.2976 0.2352 0.0627 0.0454 -0.1520 -0.0060 -0.1569 -0.1285 -0.2542 -0.1955 0.0726 0.0671 0.0695 0.1615 0.0921 0.0926 0.0907 0.1018 0.0845 0.0775 0.0923 0.0993 0.1318 0.1617 0.1499 0.0914 0.0813 0.1079 0.1056 0.1100 0.0960
va: 1.9996 5.5083 2.0633 2.0494 1.8491 1.8463 3.1199 4.0790 3.8265 3.8497 3.9548 3.9575 3.9047 3.8083 3.7809 3.9846 3.8059 4.0459 3.9216 3.9248 3.8916 1.0273 1.0116 1.0122 1.0270 1.0044 1.0067 1.0159 1.0069 0.9972 1.0071 1.0153 0.9956 1.0230 1.0063 0.9974 1.0022 1.0164 1.0111 0.9976 0.9950 1.0049
dispcorr: -0.024084918 hartree
energy: -1658.136903653515
dipole: 15.51257 -16.21104 -0.69847 3.63585 -3.43784 0.19801 1.23506 -0.75227 0.48279
magnitude: 0.87186 au
magnitude: 2.21610 debye
