program: Orca
programVersion: 5.0.2
elementType: S P O O O O N N C C C C C C C C C C C C C H H H H H H H H H H H H H H H H H H H H H
charge: 0
multiplicity: 1
keywords: wb97x-d3
keywords: def2-TZVPP
keywords: def2/J RIJCOSX
keywords: DEFGRID2
keywords: scfconv7
keywords: smallprint printgap noloewdin
keywords: NOSOSCF
formula: C13H21N2O4PS
InChI: InChI=1/C13H21N2O4PS/c1-5-11(4)14-20(21,18-6-2)19-13-9-10(3)7-8-12(13)15(16)17/h7-9,11,14H,5-6H2,1-4H3
42 atoms
S  -0.112086 2.480898 1.487743
P  0.580306 0.890591 0.654057
O  -0.293501 -0.479194 0.940452
O  0.510971 0.835791 -0.945921
O  0.121062 -2.236836 -1.136664
O  -0.877611 -1.391834 -2.826464
N  2.092787 0.476904 1.100374
N  -0.785037 -1.614748 -1.640869
C  2.853722 -0.667209 0.585069
C  4.280747 -0.219261 0.277746
C  2.796737 -1.838712 1.553726
C  5.124118 -1.301042 -0.38068
C  -1.570251 -0.607541 0.480499
C  0.718195 1.99404 -1.774951
C  -1.843804 -1.133772 -0.782844
C  -2.621118 -0.190457 1.275375
C  -3.940996 -0.305782 0.845964
C  -3.14867 -1.2262 -1.239319
C  -4.188741 -0.822777 -0.423133
C  2.165823 2.412468 -1.834362
C  -5.059293 0.112743 1.746279
H  2.392734 -0.967007 -0.358566
H  4.76029 0.115347 1.203304
H  4.23201 0.650324 -0.381831
H  2.414522 0.85696 1.981298
H  3.281923 -1.58413 2.498711
H  3.301072 -2.713875 1.144607
H  1.767683 -2.125616 1.767895
H  6.089915 -0.900858 -0.689932
H  5.320158 -2.138905 0.288425
H  4.632972 -1.696462 -1.272204
H  0.087187 2.809996 -1.41687
H  0.357739 1.697159 -2.758482
H  -2.400839 0.226942 2.249764
H  -3.356092 -1.633622 -2.219451
H  -5.206116 -0.916076 -0.779171
H  2.807314 1.595222 -2.164621
H  2.527648 2.775867 -0.872743
H  2.266293 3.227043 -2.552315
H  -5.204551 -0.620256 2.541871
H  -5.997952 0.202961 1.202734
H  -4.845848 1.067746 2.225686
elementType: S P O N C H
totalener: -1658.11330196 hartree
nucrepener: 2214.37021012 hartree
electener: -3872.48351208 hartree
oneelecener: -6679.62387070 hartree
twoeener: 2807.14035862 hartree
cpcmener: -0.02838830 hartree
kineticenergy: 1652.73944975 hartree
xcener: -123.701711732740 hartree
chargesum: 0.0000000
charge: -0.455529 0.601360 -0.365230 -0.339131 -0.388088 -0.390203 -0.214860 0.545589 0.084665 -0.096212 -0.293665 -0.288347 0.232209 0.047431 0.056717 -0.153581 -0.003931 -0.158508 -0.131425 -0.254690 -0.195162 0.071695 0.076691 0.076371 0.159282 0.095249 0.095803 0.092101 0.094585 0.086208 0.083684 0.093605 0.097888 0.132902 0.162185 0.150195 0.090194 0.082606 0.107409 0.110173 0.097006 0.104760
qa: -0.4555 0.6014 -0.3652 -0.3391 -0.3881 -0.3902 -0.2149 0.5456 0.0847 -0.0962 -0.2937 -0.2883 0.2322 0.0474 0.0567 -0.1536 -0.0039 -0.1585 -0.1314 -0.2547 -0.1952 0.0717 0.0767 0.0764 0.1593 0.0952 0.0958 0.0921 0.0946 0.0862 0.0837 0.0936 0.0979 0.1329 0.1622 0.1502 0.0902 0.0826 0.1074 0.1102 0.0970 0.1048
va: 2.0130 5.5134 2.0690 2.0580 1.8480 1.8496 3.1016 4.0848 3.8324 3.8849 3.9560 3.9497 3.9119 3.8350 3.7821 3.9845 3.8015 4.0500 3.9265 3.9129 3.8908 1.0317 1.0115 1.0095 1.0282 1.0029 1.0021 1.0165 1.0037 0.9993 0.9989 1.0148 0.9947 1.0209 1.0065 0.9974 1.0007 1.0146 1.0117 0.9946 1.0043 0.9983
dispcorr: -0.023527297 hartree
energy: -1658.136829257276
dipole: 18.07883 -18.52873 -0.44989 -0.60336 0.69412 0.09076 0.70598 -0.25712 0.44886
magnitude: 0.64197 au
magnitude: 1.63175 debye
