program: Orca
programVersion: 5.0.2
elementType: S P O O O O N N C C C C C C C C C C C C C H H H H H H H H H H H H H H H H H H H H H
charge: 0
multiplicity: 1
keywords: wb97x-d3
keywords: def2-TZVPP
keywords: def2/J RIJCOSX
keywords: DEFGRID2
keywords: scfconv7
keywords: smallprint printgap noloewdin
keywords: NOSOSCF
formula: C13H21N2O4PS
InChI: InChI=1/C13H21N2O4PS/c1-5-11(4)14-20(21,18-6-2)19-13-9-10(3)7-8-12(13)15(16)17/h7-9,11,14H,5-6H2,1-4H3
42 atoms
S  -0.106599 2.155937 2.21052
P  0.63834 1.115221 0.768014
O  -0.420615 0.714181 -0.431854
O  1.691487 1.863344 -0.168804
O  -0.373871 -2.61869 -2.561261
O  0.001592 -0.524503 -2.737469
N  1.373698 -0.258087 1.237669
N  -0.571775 -1.465957 -2.24436
C  2.0736 -1.238924 0.403722
C  3.560476 -1.297434 0.752093
C  1.427707 -2.608393 0.562567
C  4.327793 -0.002879 0.543412
C  -1.465031 -0.140802 -0.339077
C  1.376873 3.096422 -0.842789
C  -1.566399 -1.218654 -1.224572
C  -2.462898 0.035673 0.608473
C  -3.549207 -0.827431 0.688619
C  -2.638335 -2.098782 -1.142169
C  -3.624194 -1.900213 -0.199354
C  2.639501 3.908643 -0.970589
C  -4.633958 -0.582334 1.688426
H  1.973916 -0.917271 -0.636019
H  4.009364 -2.08512 0.140877
H  3.663568 -1.62575 1.791973
H  1.390519 -0.425561 2.234801
H  1.55421 -2.979165 1.582295
H  1.886326 -3.331596 -0.112893
H  0.359312 -2.578185 0.351736
H  4.26405 0.339418 -0.490837
H  3.962882 0.798761 1.185497
H  5.384368 -0.145893 0.774464
H  0.622483 3.650558 -0.278188
H  0.959845 2.8595 -1.82334
H  -2.392608 0.873355 1.289818
H  -2.711448 -2.930494 -1.829086
H  -4.462467 -2.583475 -0.157364
H  2.414912 4.839838 -1.491765
H  3.401733 3.380871 -1.544589
H  3.050748 4.162161 0.006834
H  -4.282654 0.022218 2.52316
H  -5.032294 -1.516689 2.082762
H  -5.465467 -0.047939 1.223805
elementType: S P O N C H
totalener: -1658.12401032 hartree
nucrepener: 2206.00031037 hartree
electener: -3864.12432069 hartree
oneelecener: -6662.06420683 hartree
twoeener: 2797.93988614 hartree
cpcmener: -0.02544960 hartree
kineticenergy: 1652.71689006 hartree
xcener: -123.698390747113 hartree
chargesum: 0.0000000
charge: -0.458399 0.604070 -0.334967 -0.327108 -0.386009 -0.377350 -0.215374 0.544180 0.102543 -0.107185 -0.297378 -0.269867 0.196862 0.039405 -0.007093 -0.097013 -0.017344 -0.119653 -0.147338 -0.244467 -0.197669 0.078026 0.068073 0.067793 0.161609 0.099355 0.098510 0.094870 0.077759 0.070237 0.097935 0.086609 0.097516 0.141140 0.154580 0.145009 0.092217 0.089214 0.086122 0.099496 0.101144 0.109942
qa: -0.4584 0.6041 -0.3350 -0.3271 -0.3860 -0.3774 -0.2154 0.5442 0.1025 -0.1072 -0.2974 -0.2699 0.1969 0.0394 -0.0071 -0.0970 -0.0173 -0.1197 -0.1473 -0.2445 -0.1977 0.0780 0.0681 0.0678 0.1616 0.0994 0.0985 0.0949 0.0778 0.0702 0.0979 0.0866 0.0975 0.1411 0.1546 0.1450 0.0922 0.0892 0.0861 0.0995 0.1011 0.1099
va: 1.9877 5.5032 2.0966 2.1005 1.8503 1.8556 3.0892 4.0920 3.7947 3.8894 3.9553 3.9378 3.9596 3.8408 3.7706 3.9029 3.8427 4.0216 3.9418 3.9483 3.8930 1.0216 1.0106 1.0110 1.0277 1.0056 1.0061 1.0018 1.0045 1.0155 1.0062 1.0125 0.9972 1.0260 1.0121 0.9986 1.0084 1.0030 1.0067 1.0033 1.0005 0.9945
dispcorr: -0.023757424 hartree
energy: -1658.147767745887
dipole: 12.97891 -13.88030 -0.90139 -1.96395 1.17030 -0.79365 5.59297 -4.82067 0.77230
magnitude: 1.42787 au
magnitude: 3.62937 debye
