program: Orca
programVersion: 5.0.2
elementType: S P O O O O N N C C C C C C C C C C C C C H H H H H H H H H H H H H H H H H H H H H
charge: 0
multiplicity: 1
keywords: wb97x-d3
keywords: def2-TZVPP
keywords: def2/J RIJCOSX
keywords: DEFGRID2
keywords: scfconv7
keywords: smallprint printgap noloewdin
keywords: NOSOSCF
formula: C13H21N2O4PS
InChI: InChI=1/C13H21N2O4PS/c1-5-11(4)14-20(21,18-6-2)19-13-9-10(3)7-8-12(13)15(16)17/h7-9,11,14H,5-6H2,1-4H3
42 atoms
S  0.195386 1.538551 1.907843
P  0.632352 1.12934 0.079474
O  -0.676981 0.827053 -0.879278
O  1.277624 2.295957 -0.797038
O  -0.096049 -3.03414 -1.503548
O  -0.117301 -1.208299 -2.612255
N  1.591535 -0.183673 -0.154214
N  -0.507745 -1.916418 -1.714156
C  2.580089 -0.658664 0.821842
C  2.828315 -2.141698 0.557245
C  3.848839 0.180462 0.779708
C  3.781726 -2.785986 1.55151
C  -1.628453 -0.066399 -0.498145
C  0.698936 3.615434 -0.867565
C  -1.557767 -1.41512 -0.856377
C  -2.68694 0.36388 0.280502
C  -3.682752 -0.514526 0.699586
C  -2.525863 -2.308278 -0.423677
C  -3.583114 -1.856837 0.343384
C  1.520463 4.591872 -0.065033
C  -4.822763 -0.008369 1.525342
H  2.121514 -0.559151 1.808079
H  3.217539 -2.268348 -0.458901
H  1.867139 -2.659935 0.588981
H  1.882658 -0.328919 -1.117028
H  3.627748 1.233692 0.959747
H  4.340787 0.100102 -0.192525
H  4.561329 -0.133439 1.542614
H  3.455599 -2.623427 2.580815
H  3.830615 -3.863584 1.391183
H  4.797765 -2.400939 1.460472
H  -0.337898 3.606066 -0.523628
H  0.689677 3.882255 -1.924414
H  -2.731059 1.408678 0.561138
H  -2.469024 -3.350842 -0.705335
H  -4.343137 -2.558651 0.660782
H  2.555367 4.618744 -0.407196
H  1.508556 4.342457 0.995757
H  1.104276 5.593218 -0.181051
H  -5.379525 0.763348 0.991399
H  -4.464068 0.441717 2.452286
H  -5.517156 -0.805562 1.784678
elementType: S P O N C H
totalener: -1658.12356203 hartree
nucrepener: 2196.30023821 hartree
electener: -3854.42380024 hartree
oneelecener: -6643.19369726 hartree
twoeener: 2788.76989702 hartree
cpcmener: -0.02393328 hartree
kineticenergy: 1652.72896255 hartree
xcener: -123.696476952188 hartree
chargesum: 0.0000000
charge: -0.456812 0.701098 -0.367937 -0.353351 -0.378312 -0.372270 -0.264201 0.523980 0.087519 -0.096163 -0.278104 -0.290952 0.205158 0.046442 0.069081 -0.143416 -0.005679 -0.160153 -0.126644 -0.240588 -0.194966 0.068272 0.075625 0.066147 0.154770 0.084163 0.091870 0.093899 0.084787 0.094350 0.084295 0.086154 0.105950 0.133409 0.157317 0.146354 0.088950 0.076502 0.094676 0.107701 0.107692 0.093386
qa: -0.4568 0.7011 -0.3679 -0.3534 -0.3783 -0.3723 -0.2642 0.5240 0.0875 -0.0962 -0.2781 -0.2910 0.2052 0.0464 0.0691 -0.1434 -0.0057 -0.1602 -0.1266 -0.2406 -0.1950 0.0683 0.0756 0.0661 0.1548 0.0842 0.0919 0.0939 0.0848 0.0944 0.0843 0.0862 0.1059 0.1334 0.1573 0.1464 0.0890 0.0765 0.0947 0.1077 0.1077 0.0934
va: 1.9727 5.4641 2.0881 2.0989 1.8599 1.8627 3.1730 4.1283 3.8809 3.8748 3.9361 3.9643 3.9817 3.8677 3.7903 3.9490 3.8002 4.0650 3.9209 3.9276 3.8934 1.0355 1.0089 1.0197 1.0320 1.0170 1.0031 1.0052 0.9986 1.0033 0.9991 1.0038 0.9951 1.0167 1.0101 0.9988 1.0040 1.0187 1.0092 0.9961 0.9963 1.0059
dispcorr: -0.022507094 hartree
energy: -1658.146069118600
dipole: 12.93962 -14.00248 -1.06285 2.77689 -2.20119 0.57569 11.09570 -10.75340 0.34230
magnitude: 1.25628 au
magnitude: 3.19322 debye
