program: Orca
programVersion: 5.0.2
elementType: S P O O O O N N C C C C C C C C C C C C C H H H H H H H H H H H H H H H H H H H H H
charge: 0
multiplicity: 1
keywords: wb97x-d3
keywords: def2-TZVPP
keywords: def2/J RIJCOSX
keywords: DEFGRID2
keywords: scfconv7
keywords: smallprint printgap noloewdin
keywords: NOSOSCF
formula: C13H21N2O4PS
InChI: InChI=1/C13H21N2O4PS/c1-5-11(4)14-20(21,18-6-2)19-13-9-10(3)7-8-12(13)15(16)17/h7-9,11,14H,5-6H2,1-4H3
42 atoms
S  0.231717 2.464787 1.498899
P  0.788307 0.811507 0.682623
O  -0.158079 -0.495942 1.023879
O  0.705732 0.727227 -0.917464
O  0.142642 -2.434177 -0.908978
O  -0.748132 -1.63715 -2.679561
N  2.25144 0.285547 1.168126
N  -0.696433 -1.779224 -1.479666
C  3.012488 -0.839858 0.620123
C  4.034126 -0.354308 -0.407615
C  3.644238 -1.610649 1.768887
C  4.801562 -1.482376 -1.080574
C  -1.430644 -0.547842 0.540215
C  0.564277 1.87074 -1.780411
C  -1.725469 -1.146707 -0.685426
C  -2.456082 0.039454 1.260092
C  -3.767894 0.027514 0.793391
C  -3.02048 -1.144651 -1.177707
C  -4.034804 -0.569334 -0.43633
C  -0.881948 2.108075 -2.13482
C  -4.85976 0.640253 1.61231
H  2.306482 -1.501254 0.114106
H  4.732705 0.333942 0.079311
H  3.507535 0.226501 -1.168882
H  2.757013 0.910235 1.78116
H  2.888359 -1.916483 2.492524
H  4.387412 -1.001456 2.289515
H  4.142861 -2.511885 1.413453
H  5.467266 -2.000487 -0.389579
H  4.12412 -2.224716 -1.508439
H  5.418383 -1.098377 -1.893921
H  1.15186 1.641121 -2.66875
H  1.002141 2.753051 -1.310554
H  -2.220471 0.51499 2.203937
H  -3.241999 -1.607111 -2.13007
H  -5.045814 -0.586447 -0.821999
H  -1.3174 1.246462 -2.641466
H  -0.948666 2.959826 -2.813431
H  -1.479533 2.336964 -1.251989
H  -4.546585 1.589678 2.046593
H  -5.134173 -0.016703 2.440277
H  -5.756112 0.814993 1.019173
elementType: S P O N C H
totalener: -1658.12349597 hartree
nucrepener: 2228.80576102 hartree
electener: -3886.92925699 hartree
oneelecener: -6708.23560072 hartree
twoeener: 2821.30634372 hartree
cpcmener: -0.02368110 hartree
kineticenergy: 1652.72940317 hartree
xcener: -123.699648144476 hartree
chargesum: 0.0000000
charge: -0.451133 0.601587 -0.353115 -0.344112 -0.379389 -0.377761 -0.225305 0.555906 0.085211 -0.094712 -0.290307 -0.288938 0.240059 0.040780 0.008406 -0.143331 -0.011931 -0.159795 -0.113823 -0.237502 -0.196822 0.086635 0.067967 0.065752 0.158835 0.096090 0.094441 0.092967 0.085038 0.084428 0.094506 0.107647 0.092044 0.127906 0.155823 0.146864 0.086469 0.107615 0.075776 0.104363 0.109339 0.095522
qa: -0.4511 0.6016 -0.3531 -0.3441 -0.3794 -0.3778 -0.2253 0.5559 0.0852 -0.0947 -0.2903 -0.2889 0.2401 0.0408 0.0084 -0.1433 -0.0119 -0.1598 -0.1138 -0.2375 -0.1968 0.0866 0.0680 0.0658 0.1588 0.0961 0.0944 0.0930 0.0850 0.0844 0.0945 0.1076 0.0920 0.1279 0.1558 0.1469 0.0865 0.1076 0.0758 0.1044 0.1093 0.0955
va: 2.0042 5.5292 2.0844 2.0346 1.8514 1.8627 3.1451 4.0790 3.8583 3.8817 3.9501 3.9515 3.9055 3.8182 3.7851 3.9838 3.8031 4.0189 3.9119 3.9132 3.8932 1.0078 1.0131 1.0173 1.0305 1.0111 1.0009 1.0012 0.9987 1.0000 1.0037 0.9931 1.0162 1.0229 1.0099 0.9974 1.0090 1.0116 1.0175 0.9990 0.9947 1.0045
dispcorr: -0.024229458 hartree
energy: -1658.147725430267
dipole: 11.22114 -11.92869 -0.70754 0.71267 -0.27774 0.43493 -2.86480 2.92055 0.05575
magnitude: 0.83240 au
magnitude: 2.11579 debye
