program: Orca
programVersion: 5.0.2
elementType: S P O O O O N N C C C C C C C C C C C C C H H H H H H H H H H H H H H H H H H H H H
charge: 0
multiplicity: 1
keywords: wb97x-d3
keywords: def2-TZVPP
keywords: def2/J RIJCOSX
keywords: DEFGRID2
keywords: scfconv7
keywords: smallprint printgap noloewdin
keywords: NOSOSCF
formula: C13H21N2O4PS
InChI: InChI=1/C13H21N2O4PS/c1-5-11(4)14-20(21,18-6-2)19-13-9-10(3)7-8-12(13)15(16)17/h7-9,11,14H,5-6H2,1-4H3
42 atoms
S  0.019761 2.293232 1.795092
P  0.904491 1.027495 0.647068
O  -0.072648 0.249188 -0.428698
O  1.922473 1.621887 -0.430117
O  -2.416242 -0.549179 -3.479827
O  -0.367425 -0.587589 -2.890693
N  1.703381 -0.170854 1.410854
N  -1.548392 -0.647429 -2.641408
C  2.409786 -1.290577 0.779686
C  3.881766 -1.293388 1.185023
C  1.732509 -2.606756 1.129341
C  4.648258 -0.039577 0.798164
C  -1.192686 -0.455645 -0.183599
C  1.756633 2.908729 -1.055014
C  -1.963252 -0.880455 -1.274673
C  -1.644329 -0.75351 1.096185
C  -2.828947 -1.450647 1.305283
C  -3.156854 -1.56152 -1.073569
C  -3.584609 -1.849614 0.204648
C  0.620206 2.958548 -2.046305
C  -3.264941 -1.777974 2.697995
H  2.353435 -1.149217 -0.3029
H  4.351623 -2.164303 0.720415
H  3.950911 -1.453891 2.266544
H  1.839227 -0.054251 2.405886
H  0.693725 -2.618659 0.798547
H  1.746379 -2.781998 2.207184
H  2.244766 -3.441905 0.649207
H  4.263538 0.848334 1.300459
H  5.700039 -0.134123 1.071646
H  4.606072 0.139479 -0.277714
H  2.707443 3.093259 -1.553122
H  1.632618 3.668035 -0.280011
H  -1.073954 -0.437142 1.958539
H  -3.746072 -1.883282 -1.920925
H  -4.511309 -2.389792 0.347202
H  -0.354544 2.867726 -1.566729
H  0.711038 2.184121 -2.80809
H  0.645632 3.925597 -2.550795
H  -2.787865 -2.698377 3.041814
H  -4.342151 -1.927823 2.755389
H  -2.989937 -0.990468 3.399105
elementType: S P O N C H
totalener: -1658.12336518 hartree
nucrepener: 2200.24499887 hartree
electener: -3858.36836405 hartree
oneelecener: -6650.57549457 hartree
twoeener: 2792.20713052 hartree
cpcmener: -0.02644801 hartree
kineticenergy: 1652.72146797 hartree
xcener: -123.702818270138 hartree
chargesum: -0.0000000
charge: -0.445551 0.628837 -0.312378 -0.339597 -0.389507 -0.377297 -0.246139 0.528331 0.096192 -0.098026 -0.288600 -0.275501 0.246486 0.030734 0.037920 -0.150599 -0.009507 -0.097592 -0.169569 -0.244418 -0.197827 0.074598 0.066717 0.066404 0.160623 0.097595 0.089872 0.094818 0.072663 0.097408 0.081143 0.105151 0.090985 0.098398 0.154172 0.144755 0.081487 0.086020 0.100324 0.110228 0.098397 0.101852
qa: -0.4456 0.6288 -0.3124 -0.3396 -0.3895 -0.3773 -0.2461 0.5283 0.0962 -0.0980 -0.2886 -0.2755 0.2465 0.0307 0.0379 -0.1506 -0.0095 -0.0976 -0.1696 -0.2444 -0.1978 0.0746 0.0667 0.0664 0.1606 0.0976 0.0899 0.0948 0.0727 0.0974 0.0811 0.1052 0.0910 0.0984 0.1542 0.1448 0.0815 0.0860 0.1003 0.1102 0.0984 0.1019
va: 2.0006 5.4879 2.1521 2.1032 1.8604 1.8588 3.1046 4.1070 3.8351 3.8640 3.9528 3.9415 3.9112 3.8540 3.8066 3.8442 3.8458 3.9937 3.9657 3.8905 3.8911 1.0229 1.0117 1.0103 1.0288 0.9995 1.0052 1.0080 1.0150 1.0067 1.0034 0.9902 1.0118 1.0647 1.0145 0.9994 1.0171 1.0114 1.0104 0.9945 1.0025 1.0011
dispcorr: -0.023304178 hartree
energy: -1658.146669362014
dipole: 15.58112 -15.10379 0.47733 -7.97481 6.45879 -1.51602 10.23961 -8.29736 1.94225
magnitude: 2.50968 au
magnitude: 6.37910 debye
