program: Orca
programVersion: 5.0.2
elementType: S P O O O O N N C C C C C C C C C C C C C H H H H H H H H H H H H H H H H H H H H H
charge: 0
multiplicity: 1
keywords: wb97x-d3
keywords: def2-TZVPP
keywords: def2/J RIJCOSX
keywords: DEFGRID2
keywords: scfconv7
keywords: smallprint printgap noloewdin
keywords: NOSOSCF
formula: C13H21N2O4PS
InChI: InChI=1/C13H21N2O4PS/c1-5-11(4)14-20(21,18-6-2)19-13-9-10(3)7-8-12(13)15(16)17/h7-9,11,14H,5-6H2,1-4H3
42 atoms
S  0.043687 2.124148 1.795842
P  0.677927 0.640538 0.745302
O  -0.259723 -0.714739 0.830697
O  0.649483 0.818747 -0.846697
O  -0.793451 -1.078701 -3.009332
O  0.067433 -2.250334 -1.443198
N  2.161567 0.09766 1.154866
N  -0.762716 -1.484102 -1.871459
C  2.857905 -1.058299 0.580569
C  4.351603 -0.758353 0.481076
C  2.606695 -2.320308 1.393633
C  4.69896 0.431106 -0.396065
C  -1.531281 -0.700289 0.346385
C  0.605865 2.098097 -1.502904
C  -1.810549 -1.045399 -0.976065
C  -2.569075 -0.309561 1.171733
C  -3.882157 -0.269288 0.70987
C  -3.106119 -0.98395 -1.461051
C  -4.134861 -0.607031 -0.616871
C  1.942484 2.79577 -1.506864
C  -4.984172 0.136677 1.636423
H  2.471946 -1.201692 -0.43137
H  4.842504 -1.653844 0.091976
H  4.75125 -0.608405 1.48953
H  2.477997 0.380237 2.073801
H  2.976026 -2.20416 2.414703
H  3.12314 -3.172069 0.949109
H  1.547486 -2.566923 1.445397
H  4.287477 1.360169 -0.003278
H  5.780204 0.556055 -0.464864
H  4.320413 0.300018 -1.411304
H  -0.158518 2.719283 -1.033182
H  0.279498 1.877153 -2.518359
H  -2.342563 -0.033058 2.193767
H  -3.315943 -1.25064 -2.488031
H  -5.146844 -0.577336 -0.99873
H  2.277708 3.040937 -0.498623
H  1.848531 3.732406 -2.058701
H  2.709094 2.195677 -1.996091
H  -5.11944 -0.604079 2.426698
H  -5.932329 0.24258 1.111907
H  -4.758326 1.085707 2.124171
elementType: S P O N C H
totalener: -1658.12450264 hartree
nucrepener: 2226.25163502 hartree
electener: -3884.37613766 hartree
oneelecener: -6703.20172348 hartree
twoeener: 2818.82558582 hartree
cpcmener: -0.02358783 hartree
kineticenergy: 1652.74856022 hartree
xcener: -123.702114646109 hartree
chargesum: 0.0000000
charge: -0.450751 0.599641 -0.355541 -0.345494 -0.377383 -0.375109 -0.217317 0.533473 0.093748 -0.085715 -0.286839 -0.294004 0.227731 0.058230 0.047402 -0.148582 -0.007528 -0.157210 -0.126348 -0.251743 -0.196880 0.074191 0.066975 0.068197 0.158417 0.089613 0.091476 0.092828 0.077520 0.101347 0.084227 0.091946 0.098371 0.130371 0.158372 0.146259 0.080730 0.105734 0.090625 0.108776 0.093882 0.106364
qa: -0.4508 0.5996 -0.3555 -0.3455 -0.3774 -0.3751 -0.2173 0.5335 0.0937 -0.0857 -0.2868 -0.2940 0.2277 0.0582 0.0474 -0.1486 -0.0075 -0.1572 -0.1263 -0.2517 -0.1969 0.0742 0.0670 0.0682 0.1584 0.0896 0.0915 0.0928 0.0775 0.1013 0.0842 0.0919 0.0984 0.1304 0.1584 0.1463 0.0807 0.1057 0.0906 0.1088 0.0939 0.1064
va: 2.0058 5.5171 2.0781 2.0545 1.8618 1.8600 3.1111 4.1020 3.8344 3.8483 3.9514 3.9574 3.9191 3.8177 3.7888 3.9873 3.8101 4.0483 3.9220 3.9207 3.8929 1.0268 1.0117 1.0118 1.0294 1.0052 1.0072 1.0170 1.0072 1.0072 0.9975 1.0153 0.9953 1.0228 1.0076 0.9987 1.0169 1.0116 1.0022 0.9952 1.0055 0.9970
dispcorr: -0.024025434 hartree
energy: -1658.148528071026
dipole: 15.60046 -16.20345 -0.60299 3.30344 -3.17134 0.13210 1.48758 -1.05417 0.43341
magnitude: 0.75425 au
magnitude: 1.91715 debye
