program: Orca
programVersion: 5.0.2
elementType: S P O O O O N N C C C C C C C C C C C C C H H H H H H H H H H H H H H H H H H H H H
charge: 0
multiplicity: 1
keywords: wb97x-d3
keywords: def2-TZVPP
keywords: def2/J RIJCOSX
keywords: DEFGRID2
keywords: scfconv7
keywords: smallprint printgap noloewdin
keywords: NOSOSCF
formula: C13H21N2O4PS
InChI: InChI=1/C13H21N2O4PS/c1-5-11(4)14-20(21,18-6-2)19-13-9-10(3)7-8-12(13)15(16)17/h7-9,11,14H,5-6H2,1-4H3
42 atoms
S  0.04304 2.182769 1.765045
P  0.689167 0.697145 0.72305
O  -0.236493 -0.66494 0.787169
O  0.679257 0.887679 -0.869382
O  -0.804137 -1.029043 -3.053975
O  0.099267 -2.188341 -1.502248
N  2.159855 0.146258 1.169824
N  -0.750213 -1.43741 -1.917622
C  2.804774 -1.093992 0.727474
C  4.284489 -0.846111 0.447867
C  2.615169 -2.200787 1.755696
C  4.552113 0.151443 -0.666215
C  -1.511346 -0.672039 0.311798
C  0.651589 2.176096 -1.5104
C  -1.795896 -1.023062 -1.00811
C  -2.55229 -0.313374 1.148682
C  -3.872302 -0.325586 0.704558
C  -3.099009 -1.007694 -1.476777
C  -4.130006 -0.672047 -0.61891
C  2.006835 2.837484 -1.543236
C  -4.981388 0.020885 1.647066
H  2.330041 -1.394244 -0.209318
H  4.738543 -1.807553 0.193768
H  4.771634 -0.515915 1.371668
H  2.501633 0.523671 2.044308
H  3.065302 -3.131207 1.406991
H  1.560335 -2.393477 1.94966
H  3.09017 -1.937004 2.703525
H  4.221196 1.154878 -0.400699
H  5.619319 0.207853 -0.885946
H  4.043839 -0.136876 -1.588578
H  -0.080761 2.813771 -1.011403
H  0.290283 1.978608 -2.518952
H  -2.323965 -0.029805 2.16858
H  -3.312316 -1.282911 -2.500919
H  -5.14797 -0.685375 -0.985803
H  2.745914 2.217443 -2.049717
H  2.37058 3.072625 -0.542353
H  1.927024 3.77661 -2.0928
H  -4.785464 0.961902 2.162004
H  -5.088849 -0.747399 2.415224
H  -5.935212 0.108939 1.12952
elementType: S P O N C H
totalener: -1658.12444331 hartree
nucrepener: 2222.00557688 hartree
electener: -3880.13002019 hartree
oneelecener: -6694.71337741 hartree
twoeener: 2814.58335722 hartree
cpcmener: -0.02352198 hartree
kineticenergy: 1652.72947670 hartree
xcener: -123.698393569477 hartree
chargesum: 0.0000000
charge: -0.452164 0.600821 -0.352283 -0.344273 -0.377585 -0.374846 -0.224264 0.533124 0.100635 -0.094030 -0.291862 -0.293309 0.221522 0.058644 0.055098 -0.147415 -0.010683 -0.160286 -0.124441 -0.257427 -0.196659 0.081620 0.068273 0.068741 0.158393 0.091866 0.094480 0.089886 0.078172 0.100291 0.084339 0.091395 0.098869 0.131147 0.158282 0.146216 0.090603 0.083987 0.106165 0.105936 0.108775 0.094246
qa: -0.4522 0.6008 -0.3523 -0.3443 -0.3776 -0.3748 -0.2243 0.5331 0.1006 -0.0940 -0.2919 -0.2933 0.2215 0.0586 0.0551 -0.1474 -0.0107 -0.1603 -0.1244 -0.2574 -0.1967 0.0816 0.0683 0.0687 0.1584 0.0919 0.0945 0.0899 0.0782 0.1003 0.0843 0.0914 0.0989 0.1311 0.1583 0.1462 0.0906 0.0840 0.1062 0.1059 0.1088 0.0942
va: 2.0051 5.5182 2.0880 2.0537 1.8617 1.8581 3.1031 4.0994 3.8297 3.8580 3.9589 3.9545 3.9208 3.8167 3.7963 3.9879 3.8128 4.0542 3.9223 3.9194 3.8932 1.0189 1.0113 1.0121 1.0292 1.0069 1.0131 1.0035 1.0055 1.0073 0.9995 1.0169 0.9951 1.0215 1.0078 0.9986 1.0013 1.0152 1.0119 0.9974 0.9949 1.0052
dispcorr: -0.023750850 hartree
energy: -1658.148194157361
dipole: 15.26640 -15.89153 -0.62512 2.26106 -2.22176 0.03930 2.03884 -1.49873 0.54011
magnitude: 0.82707 au
magnitude: 2.10224 debye
