program: Orca
programVersion: 5.0.2
elementType: S P O O O O N N C C C C C C C C C C C C C H H H H H H H H H H H H H H H H H H H H H
charge: 0
multiplicity: 1
keywords: wb97x-d3
keywords: def2-TZVPP
keywords: def2/J RIJCOSX
keywords: DEFGRID2
keywords: scfconv7
keywords: smallprint printgap noloewdin
keywords: NOSOSCF
formula: C13H21N2O4PS
InChI: InChI=1/C13H21N2O4PS/c1-5-11(4)14-20(21,18-6-2)19-13-9-10(3)7-8-12(13)15(16)17/h7-9,11,14H,5-6H2,1-4H3
42 atoms
S  0.288227 2.031164 1.929931
P  0.828493 0.56241 0.819876
O  -0.168481 -0.744905 0.821804
O  0.852378 0.807984 -0.764502
O  -0.725667 -1.00378 -3.062042
O  0.126234 -2.204582 -1.505021
N  2.27243 -0.092348 1.218918
N  -0.679327 -1.413967 -1.927205
C  2.938545 -1.202735 0.540558
C  4.366508 -0.810345 0.168172
C  2.892543 -2.464858 1.390104
C  4.448821 0.400192 -0.747855
C  -1.425452 -0.649129 0.317857
C  0.925328 2.110587 -1.357701
C  -1.708379 -0.945494 -1.014701
C  -2.4517 -0.220487 1.142267
C  -3.756609 -0.10864 0.675482
C  -2.996303 -0.807491 -1.503271
C  -4.014043 -0.403984 -0.659138
C  -0.450661 2.587134 -1.754407
C  -4.851326 0.318665 1.605143
H  2.389701 -1.393147 -0.384007
H  4.837332 -1.670745 -0.314729
H  4.941938 -0.628934 1.08292
H  2.62957 0.170422 2.12489
H  3.36885 -3.296581 0.87035
H  1.863983 -2.748266 1.607529
H  3.417703 -2.323595 2.3376
H  5.480661 0.607499 -1.030648
H  3.879998 0.238213 -1.664826
H  4.052601 1.293383 -0.265407
H  1.574029 2.001796 -2.226324
H  1.396325 2.815715 -0.669451
H  -2.211167 0.032528 2.166944
H  -3.201969 -1.024674 -2.541904
H  -5.02056 -0.316307 -1.046721
H  -1.082752 2.720137 -0.877075
H  -0.930733 1.881263 -2.431502
H  -0.375535 3.548158 -2.264392
H  -5.081346 -0.471495 2.3218
H  -5.768556 0.551641 1.067073
H  -4.563517 1.200448 2.177151
totalener: -1658.10617177 hartree
nucrepener: 2239.86381336 hartree
electener: -3897.96998513 hartree
oneelecener: -6729.69543252 hartree
twoeener: 2831.72544739 hartree
kineticenergy: 1652.78785391 hartree
xcener: -123.707494774518 hartree
chargesum: 0.0000000
charge: -0.390386 0.565211 -0.326439 -0.326970 -0.334196 -0.333451 -0.222071 0.512541 0.053983 -0.085145 -0.253091 -0.261050 0.224888 0.023742 -0.009434 -0.111292 -0.012735 -0.146570 -0.087867 -0.229223 -0.204230 0.083189 0.062347 0.055913 0.135360 0.080982 0.103958 0.073193 0.094981 0.079724 0.071774 0.096512 0.092816 0.117459 0.137949 0.115770 0.083578 0.088750 0.089552 0.104380 0.081808 0.103794
qa: -0.3904 0.5652 -0.3264 -0.3270 -0.3342 -0.3335 -0.2221 0.5125 0.0540 -0.0851 -0.2531 -0.2611 0.2249 0.0237 -0.0094 -0.1113 -0.0127 -0.1466 -0.0879 -0.2292 -0.2042 0.0832 0.0623 0.0559 0.1354 0.0810 0.1040 0.0732 0.0950 0.0797 0.0718 0.0965 0.0928 0.1175 0.1379 0.1158 0.0836 0.0888 0.0896 0.1044 0.0818 0.1038
va: 2.0655 5.5565 2.1028 2.0507 1.8954 1.8939 3.1000 4.1278 3.8862 3.8719 3.9624 3.9407 3.9530 3.8525 3.8918 4.0031 3.8433 4.0591 3.9395 3.9219 3.9057 1.0221 1.0143 1.0145 1.0465 1.0104 1.0125 1.0066 1.0089 1.0024 1.0164 0.9913 1.0124 1.0247 1.0187 1.0073 1.0198 1.0101 1.0144 0.9945 1.0080 0.9987
dispcorr: -0.024808428 hartree
energy: -1658.130980198527
dipole: 10.29996 -10.77699 -0.47703 3.05777 -2.94160 0.11617 -0.30337 0.59100 0.28763
magnitude: 0.56902 au
magnitude: 1.44634 debye
