program: Orca
programVersion: 5.0.2
elementType: S P O O O O N N C C C C C C C C C C C C C H H H H H H H H H H H H H H H H H H H H H
charge: 0
multiplicity: 1
keywords: wb97x-d3
keywords: def2-TZVPP
keywords: def2/J RIJCOSX
keywords: DEFGRID2
keywords: scfconv7
keywords: smallprint printgap noloewdin
keywords: NOSOSCF
formula: C13H21N2O4PS
InChI: InChI=1/C13H21N2O4PS/c1-5-11(4)14-20(21,18-6-2)19-13-9-10(3)7-8-12(13)15(16)17/h7-9,11,14H,5-6H2,1-4H3
42 atoms
S  0.640135 2.182463 1.688051
P  0.775932 1.299487 -0.015853
O  -0.648224 0.930761 -0.754941
O  1.411964 2.177276 -1.190493
O  0.030628 -0.987434 -2.584939
O  -1.819408 -1.743951 -3.342847
N  1.540086 -0.149928 -0.007726
N  -1.133527 -1.291824 -2.461082
C  2.624304 -0.505892 0.901372
C  2.469489 -1.959553 1.339458
C  3.986288 -0.229038 0.277975
C  1.159735 -2.238006 2.06149
C  -1.458239 -0.063364 -0.318458
C  1.333658 3.607072 -1.21841
C  -1.753128 -1.140607 -1.154176
C  -2.080075 0.012967 0.918565
C  -2.963915 -0.970522 1.344394
C  -2.665094 -2.107161 -0.758194
C  -3.247825 -2.033416 0.490971
C  -0.052538 4.117023 -1.541907
C  -3.622101 -0.857368 2.685723
H  2.505449 0.12786 1.783618
H  3.311277 -2.205101 1.99252
H  2.568283 -2.615159 0.466979
H  1.498915 -0.675092 -0.87317
H  4.790163 -0.465254 0.976024
H  4.080581 0.820515 -0.000263
H  4.140046 -0.82916 -0.621162
H  1.117379 -3.269693 2.410581
H  1.045538 -1.587442 2.929796
H  0.299429 -2.069189 1.414292
H  2.04623 3.909269 -1.98526
H  1.675283 4.007319 -0.260843
H  -1.862313 0.862754 1.552787
H  -2.901709 -2.925371 -1.423398
H  -3.938454 -2.806484 0.801142
H  -0.428578 3.693313 -2.472134
H  -0.0203 5.2015 -1.652546
H  -0.758895 3.889461 -0.743966
H  -3.998778 -1.818705 3.031197
H  -4.468763 -0.169798 2.641662
H  -2.932335 -0.474403 3.43671
totalener: -1658.10617473 hartree
nucrepener: 2218.23995861 hartree
electener: -3876.34613334 hartree
oneelecener: -6686.19787254 hartree
twoeener: 2809.85173920 hartree
kineticenergy: 1652.77933277 hartree
xcener: -123.708963888008 hartree
chargesum: -0.0000000
charge: -0.415681 0.667813 -0.342061 -0.326996 -0.351272 -0.320992 -0.251684 0.508329 0.043430 -0.098738 -0.244994 -0.223663 0.139284 0.016903 0.016143 -0.084603 -0.024406 -0.111039 -0.100626 -0.229492 -0.202618 0.070907 0.061661 0.058663 0.163939 0.079830 0.090388 0.078118 0.089538 0.077947 0.053518 0.096764 0.089201 0.127146 0.135776 0.115939 0.089986 0.083787 0.082050 0.084202 0.106910 0.100693
qa: -0.4157 0.6678 -0.3421 -0.3270 -0.3513 -0.3210 -0.2517 0.5083 0.0434 -0.0987 -0.2450 -0.2237 0.1393 0.0169 0.0161 -0.0846 -0.0244 -0.1110 -0.1006 -0.2295 -0.2026 0.0709 0.0617 0.0587 0.1639 0.0798 0.0904 0.0781 0.0895 0.0779 0.0535 0.0968 0.0892 0.1271 0.1358 0.1159 0.0900 0.0838 0.0820 0.0842 0.1069 0.1007
va: 2.0181 5.4464 2.1182 2.1213 1.8763 1.9243 3.1180 4.1185 3.8967 3.8688 3.9620 3.9382 4.0761 3.8887 3.8432 3.9053 3.8439 4.0571 3.9501 3.8878 3.9061 1.0364 1.0142 1.0137 1.0415 1.0099 1.0136 1.0077 1.0084 1.0084 1.0196 0.9907 1.0151 1.0323 1.0204 1.0073 1.0077 1.0113 1.0226 1.0063 0.9941 1.0015
dispcorr: -0.023280925 hartree
energy: -1658.129455656608
dipole: 8.47019 -8.78430 -0.31411 -3.16917 2.78017 -0.38900 14.28290 -13.38006 0.90284
magnitude: 1.03204 au
magnitude: 2.62323 debye
