program: Orca
programVersion: 5.0.2
elementType: S P O O O O N N C C C C C C C C C C C C C H H H H H H H H H H H H H H H H H H H H H
charge: 0
multiplicity: 1
keywords: wb97x-d3
keywords: def2-TZVPP
keywords: def2/J RIJCOSX
keywords: DEFGRID2
keywords: scfconv7
keywords: smallprint printgap noloewdin
keywords: NOSOSCF
formula: C13H21N2O4PS
InChI: InChI=1/C13H21N2O4PS/c1-5-11(4)14-20(21,18-6-2)19-13-9-10(3)7-8-12(13)15(16)17/h7-9,11,14H,5-6H2,1-4H3
42 atoms
S  0.290598 2.34703 1.55559
P  0.66845 1.304265 -0.014962
O  -0.647038 0.76358 -0.849617
O  1.368075 2.09162 -1.216351
O  0.32564 -1.372605 -2.213157
O  -1.299449 -2.555268 -2.931809
N  1.5357 -0.059263 0.236728
N  -0.801504 -1.803506 -2.131736
C  2.497212 -0.245828 1.319184
C  2.494646 -1.708965 1.763265
C  3.879135 0.268427 0.935233
C  2.913619 -2.717346 0.70064
C  -1.492773 -0.175992 -0.36413
C  0.957108 3.415695 -1.58522
C  -1.617425 -1.41875 -0.990701
C  -2.325301 0.117448 0.706156
C  -3.254124 -0.801384 1.177322
C  -2.560222 -2.334384 -0.544459
C  -3.356533 -2.035808 0.541634
C  1.969061 4.431233 -1.109599
C  -4.150809 -0.444138 2.323323
H  2.131564 0.348585 2.158801
H  1.492025 -1.954043 2.121502
H  3.160129 -1.796527 2.626033
H  1.660398 -0.649928 -0.575013
H  3.842379 1.337715 0.726365
H  4.26607 -0.227417 0.044062
H  4.593489 0.109778 1.744306
H  3.917639 -2.525627 0.321403
H  2.914153 -3.726235 1.112597
H  2.231621 -2.729996 -0.15155
H  -0.030229 3.645447 -1.176119
H  0.872621 3.41609 -2.67245
H  -2.237704 1.091272 1.170309
H  -2.659135 -3.286726 -1.045078
H  -4.07375 -2.767121 0.890681
H  1.683839 5.426097 -1.452451
H  2.962476 4.212774 -1.50072
H  2.015998 4.448442 -0.021409
H  -4.558246 -1.330567 2.806874
H  -4.994004 0.156359 1.977146
H  -3.623418 0.14043 3.075857
totalener: -1658.10459367 hartree
nucrepener: 2193.12868886 hartree
electener: -3851.23328254 hartree
oneelecener: -6636.03606731 hartree
twoeener: 2784.80278477 hartree
kineticenergy: 1652.77374554 hartree
xcener: -123.708062748495 hartree
chargesum: -0.0000000
charge: -0.418309 0.670115 -0.342926 -0.325448 -0.355196 -0.324258 -0.261998 0.507749 0.062504 -0.098208 -0.254972 -0.266391 0.153122 0.030651 -0.002359 -0.072783 -0.025339 -0.107025 -0.108993 -0.232527 -0.203903 0.080437 0.072808 0.061473 0.170977 0.090094 0.077508 0.083193 0.082990 0.089375 0.069228 0.077365 0.095590 0.127160 0.137006 0.116138 0.080947 0.084763 0.086801 0.084507 0.106522 0.101613
qa: -0.4183 0.6701 -0.3429 -0.3254 -0.3552 -0.3243 -0.2620 0.5077 0.0625 -0.0982 -0.2550 -0.2664 0.1531 0.0307 -0.0024 -0.0728 -0.0253 -0.1070 -0.1090 -0.2325 -0.2039 0.0804 0.0728 0.0615 0.1710 0.0901 0.0775 0.0832 0.0830 0.0894 0.0692 0.0774 0.0956 0.1272 0.1370 0.1161 0.0809 0.0848 0.0868 0.0845 0.1065 0.1016
va: 2.0149 5.4668 2.1297 2.1189 1.8677 1.9216 3.1705 4.1300 3.9182 3.8666 3.9502 3.9418 4.0816 3.8910 3.8876 3.9396 3.8591 4.0471 3.9540 3.9191 3.9048 1.0349 1.0170 1.0108 1.0337 1.0171 1.0047 1.0084 1.0003 1.0065 1.0116 1.0123 0.9951 1.0319 1.0240 1.0079 1.0125 1.0048 1.0199 1.0061 0.9936 1.0016
dispcorr: -0.021950729 hartree
energy: -1658.126544402489
dipole: 13.80998 -14.27815 -0.46817 0.06272 -0.24646 -0.18374 12.50994 -11.67219 0.83775
magnitude: 0.97712 au
magnitude: 2.48364 debye
