program: Orca
programVersion: 5.0.2
elementType: S P O O O O N N C C C C C C C C C C C C C H H H H H H H H H H H H H H H H H H H H H
charge: 0
multiplicity: 1
keywords: wb97x-d3
keywords: def2-TZVPP
keywords: def2/J RIJCOSX
keywords: DEFGRID2
keywords: scfconv7
keywords: smallprint printgap noloewdin
keywords: NOSOSCF
formula: C13H21N2O4PS
InChI: InChI=1/C13H21N2O4PS/c1-5-11(4)14-20(21,18-6-2)19-13-9-10(3)7-8-12(13)15(16)17/h7-9,11,14H,5-6H2,1-4H3
42 atoms
S  0.192166 1.61393 1.864806
P  0.611062 1.160347 0.048252
O  -0.696528 0.831493 -0.89837
O  1.249061 2.30979 -0.860023
O  -0.150235 -3.069335 -1.586893
O  -0.051589 -1.186015 -2.600396
N  1.574484 -0.154004 -0.166006
N  -0.499746 -1.925876 -1.758202
C  2.541785 -0.632192 0.824641
C  2.801186 -2.112725 0.553964
C  3.807876 0.214552 0.824182
C  3.70537 -2.773658 1.583664
C  -1.623457 -0.079871 -0.514214
C  0.706936 3.637069 -0.875971
C  -1.555783 -1.421205 -0.897962
C  -2.66735 0.330029 0.298113
C  -3.654971 -0.55285 0.717087
C  -2.522387 -2.317545 -0.469669
C  -3.568089 -1.883685 0.321828
C  1.611626 4.579333 -0.11737
C  -4.772079 -0.064663 1.587947
H  2.056892 -0.539422 1.799244
H  3.239942 -2.229365 -0.443366
H  1.839236 -2.62837 0.525626
H  1.830135 -0.350538 -1.126794
H  3.571985 1.260198 1.022266
H  4.317537 0.158843 -0.140179
H  4.508602 -0.111882 1.592219
H  3.323188 -2.634855 2.596349
H  3.770534 -3.846177 1.403215
H  4.7213 -2.379911 1.555918
H  -0.300301 3.653015 -0.450937
H  0.625468 3.920456 -1.925985
H  -2.691704 1.36571 0.61133
H  -2.457819 -3.354918 -0.764979
H  -4.323777 -2.591344 0.636275
H  2.624489 4.562805 -0.519526
H  1.649733 4.313804 0.93836
H  1.234515 5.599119 -0.198555
H  -5.349506 0.712944 1.086306
H  -4.384644 0.365995 2.511868
H  -5.456886 -0.867453 1.854843
totalener: -1658.10426166 hartree
nucrepener: 2197.78012952 hartree
electener: -3855.88439119 hartree
oneelecener: -6645.47803733 hartree
twoeener: 2789.59364615 hartree
kineticenergy: 1652.77620773 hartree
xcener: -123.703741733122 hartree
chargesum: -0.0000000
charge: -0.401470 0.661628 -0.341721 -0.324074 -0.333899 -0.334560 -0.267384 0.482932 0.052181 -0.090981 -0.244321 -0.273327 0.206142 0.035341 0.036157 -0.108707 -0.012155 -0.143208 -0.096616 -0.229255 -0.203129 0.069513 0.064827 0.079370 0.139205 0.087220 0.078598 0.083502 0.080972 0.091515 0.076120 0.073911 0.095662 0.113439 0.139879 0.115167 0.084708 0.085433 0.081172 0.102028 0.107857 0.080329
qa: -0.4015 0.6616 -0.3417 -0.3241 -0.3339 -0.3346 -0.2674 0.4829 0.0522 -0.0910 -0.2443 -0.2733 0.2061 0.0353 0.0362 -0.1087 -0.0122 -0.1432 -0.0966 -0.2293 -0.2031 0.0695 0.0648 0.0794 0.1392 0.0872 0.0786 0.0835 0.0810 0.0915 0.0761 0.0739 0.0957 0.1134 0.1399 0.1152 0.0847 0.0854 0.0812 0.1020 0.1079 0.0803
va: 2.0270 5.4935 2.1172 2.1176 1.8915 1.8884 3.1673 4.1605 3.9344 3.8786 3.9232 3.9635 4.0323 3.9022 3.8761 3.9753 3.8515 4.0966 3.9429 3.9192 3.9050 1.0334 1.0117 1.0202 1.0468 1.0204 1.0075 1.0088 1.0010 1.0054 1.0023 1.0085 0.9955 1.0235 1.0204 1.0083 1.0053 1.0206 1.0124 0.9965 0.9960 1.0090
dispcorr: -0.022448933 hartree
energy: -1658.126710595247
dipole: 13.04120 -13.75305 -0.71185 2.53276 -2.13693 0.39584 11.70776 -11.32621 0.38155
magnitude: 0.89944 au
magnitude: 2.28620 debye
