program: Orca
programVersion: 5.0.2
elementType: S P O O O O N N C C C C C C C C C C C C C H H H H H H H H H H H H H H H H H H H H H
charge: 0
multiplicity: 1
keywords: wb97x-d3
keywords: def2-TZVPP
keywords: def2/J RIJCOSX
keywords: DEFGRID2
keywords: scfconv7
keywords: smallprint printgap noloewdin
keywords: NOSOSCF
formula: C13H21N2O4PS
InChI: InChI=1/C13H21N2O4PS/c1-5-11(4)14-20(21,18-6-2)19-13-9-10(3)7-8-12(13)15(16)17/h7-9,11,14H,5-6H2,1-4H3
42 atoms
S  0.226949 2.478095 1.527324
P  0.80286 0.850598 0.688531
O  -0.111136 -0.48198 0.986274
O  0.750866 0.813238 -0.918186
O  0.219491 -2.400653 -0.963858
O  -0.741656 -1.65039 -2.725085
N  2.274564 0.326045 1.164678
N  -0.643048 -1.775616 -1.527802
C  3.007576 -0.827877 0.645419
C  4.02876 -0.400041 -0.409018
C  3.630987 -1.581626 1.811635
C  4.718408 -1.569957 -1.097123
C  -1.37853 -0.543678 0.50349
C  0.514213 1.965305 -1.736914
C  -1.672886 -1.151869 -0.715621
C  -2.40474 0.047076 1.223094
C  -3.717646 0.020613 0.76842
C  -2.973017 -1.166571 -1.192889
C  -3.988064 -0.595104 -0.450128
C  -0.946977 2.082122 -2.101049
C  -4.809208 0.639195 1.588162
H  2.279894 -1.486158 0.167658
H  4.77503 0.254999 0.053422
H  3.510118 0.202006 -1.157884
H  2.770048 0.94933 1.782729
H  2.867941 -1.867481 2.534096
H  4.375727 -0.967885 2.325041
H  4.129037 -2.489772 1.475605
H  5.346247 -2.14161 -0.413614
H  3.988484 -2.255252 -1.531284
H  5.359399 -1.220865 -1.906223
H  1.129761 1.824599 -2.625503
H  0.856452 2.866807 -1.224481
H  -2.156256 0.542039 2.153126
H  -3.188573 -1.62847 -2.145999
H  -5.001963 -0.624791 -0.827323
H  -1.298091 1.192608 -2.622848
H  -1.091162 2.938376 -2.760976
H  -1.560904 2.236453 -1.213495
H  -4.48775 1.581779 2.029939
H  -5.099293 -0.021167 2.407293
H  -5.699499 0.833324 0.992158
totalener: -1658.10429263 hartree
nucrepener: 2231.73295267 hartree
electener: -3889.83724530 hartree
oneelecener: -6713.38664323 hartree
twoeener: 2823.54939793 hartree
kineticenergy: 1652.78133608 hartree
xcener: -123.707698239619 hartree
chargesum: -0.0000000
charge: -0.392485 0.571574 -0.323847 -0.331731 -0.336883 -0.333274 -0.219492 0.519741 0.050128 -0.076448 -0.274727 -0.271957 0.217128 0.029708 -0.024001 -0.109778 -0.016109 -0.143640 -0.082894 -0.230794 -0.203043 0.094616 0.055150 0.067510 0.134042 0.103995 0.079032 0.085156 0.073855 0.090241 0.087170 0.095272 0.089728 0.118104 0.137998 0.116609 0.090600 0.093749 0.080014 0.101333 0.105086 0.083565
qa: -0.3925 0.5716 -0.3238 -0.3317 -0.3369 -0.3333 -0.2195 0.5197 0.0501 -0.0764 -0.2747 -0.2720 0.2171 0.0297 -0.0240 -0.1098 -0.0161 -0.1436 -0.0829 -0.2308 -0.2030 0.0946 0.0552 0.0675 0.1340 0.1040 0.0790 0.0852 0.0739 0.0902 0.0872 0.0953 0.0897 0.1181 0.1380 0.1166 0.0906 0.0937 0.0800 0.1013 0.1051 0.0836
va: 2.0610 5.5508 2.1164 2.0401 1.8818 1.8986 3.1293 4.1128 3.9095 3.8727 3.9528 3.9541 3.9601 3.8542 3.8897 3.9988 3.8331 4.0467 3.9359 3.9078 3.9060 1.0059 1.0147 1.0198 1.0485 1.0109 1.0043 1.0054 1.0022 1.0032 1.0059 0.9921 1.0174 1.0251 1.0197 1.0065 1.0106 1.0148 1.0174 1.0007 0.9941 1.0071
dispcorr: -0.024342684 hartree
energy: -1658.128635318730
dipole: 10.54217 -11.08737 -0.54521 0.36504 -0.10746 0.25758 -2.54578 2.65749 0.11171
magnitude: 0.61325 au
magnitude: 1.55876 debye
