program: Orca
programVersion: 5.0.2
elementType: S P O O O O N N C C C C C C C C C C C C C H H H H H H H H H H H H H H H H H H H H H
charge: 0
multiplicity: 1
keywords: wb97x-d3
keywords: def2-TZVPP
keywords: def2/J RIJCOSX
keywords: DEFGRID2
keywords: scfconv7
keywords: smallprint printgap noloewdin
keywords: NOSOSCF
formula: C13H21N2O4PS
InChI: InChI=1/C13H21N2O4PS/c1-5-11(4)14-20(21,18-6-2)19-13-9-10(3)7-8-12(13)15(16)17/h7-9,11,14H,5-6H2,1-4H3
42 atoms
S  0.086411 2.102813 1.819254
P  0.687871 0.616835 0.763501
O  -0.250064 -0.731835 0.843437
O  0.676706 0.801701 -0.829521
O  -0.839771 -1.297608 -3.010264
O  0.11268 -2.300462 -1.373745
N  2.168852 0.050588 1.171477
N  -0.75063 -1.604075 -1.845489
C  2.866859 -1.092862 0.582198
C  4.357415 -0.777602 0.471614
C  2.626716 -2.369526 1.376797
C  4.678841 0.428122 -0.395473
C  -1.513189 -0.714148 0.34739
C  0.560855 2.076661 -1.471552
C  -1.793504 -1.119041 -0.956945
C  -2.546485 -0.256879 1.14706
C  -3.857365 -0.222525 0.685844
C  -3.090899 -1.069546 -1.438184
C  -4.115607 -0.636819 -0.616729
C  1.862631 2.843212 -1.469483
C  -4.952901 0.259365 1.587698
H  2.468402 -1.228132 -0.425846
H  4.858549 -1.662967 0.072262
H  4.766821 -0.634867 1.478337
H  2.485393 0.342982 2.084424
H  1.567419 -2.61163 1.422437
H  3.002679 -2.272313 2.397667
H  3.142201 -3.211422 0.914011
H  4.305964 0.291273 -1.411947
H  4.230921 1.338636 0.000388
H  5.755232 0.586987 -0.458757
H  -0.227469 2.656668 -0.987293
H  0.240026 1.847212 -2.487187
H  -2.306609 0.08429 2.145973
H  -3.297444 -1.374941 -2.454127
H  -5.127879 -0.616917 -0.998629
H  2.665779 2.268485 -1.929524
H  2.160366 3.114554 -0.456598
H  1.740418 3.766131 -2.03748
H  -4.703691 1.226163 2.025061
H  -5.114001 -0.436659 2.412021
H  -5.896285 0.365776 1.054962
totalener: -1658.10516881 hartree
nucrepener: 2225.68825125 hartree
electener: -3883.79342006 hartree
oneelecener: -6701.34293148 hartree
twoeener: 2817.54951142 hartree
kineticenergy: 1652.78508702 hartree
xcener: -123.706707556329 hartree
chargesum: -0.0000000
charge: -0.391843 0.567293 -0.330843 -0.331900 -0.334317 -0.330939 -0.215356 0.494023 0.055412 -0.087276 -0.250386 -0.266322 0.204409 0.041267 0.021449 -0.107432 -0.015078 -0.139989 -0.095792 -0.244031 -0.203727 0.077152 0.062971 0.056795 0.135595 0.105209 0.073799 0.080004 0.078428 0.076921 0.095671 0.091175 0.097463 0.120617 0.138464 0.115180 0.086581 0.086638 0.092789 0.105156 0.104059 0.080711
qa: -0.3918 0.5673 -0.3308 -0.3319 -0.3343 -0.3309 -0.2154 0.4940 0.0554 -0.0873 -0.2504 -0.2663 0.2044 0.0413 0.0214 -0.1074 -0.0151 -0.1400 -0.0958 -0.2440 -0.2037 0.0772 0.0630 0.0568 0.1356 0.1052 0.0738 0.0800 0.0784 0.0769 0.0957 0.0912 0.0975 0.1206 0.1385 0.1152 0.0866 0.0866 0.0928 0.1052 0.1041 0.0807
va: 2.0619 5.5390 2.1015 2.0604 1.8986 1.8944 3.0857 4.1412 3.8887 3.8641 3.9503 3.9488 3.9807 3.8416 3.8861 4.0014 3.8544 4.0782 3.9459 3.9144 3.9059 1.0248 1.0141 1.0136 1.0465 1.0183 1.0079 1.0113 1.0009 1.0125 1.0100 1.0150 0.9938 1.0253 1.0191 1.0082 1.0028 1.0193 1.0155 0.9978 0.9951 1.0084
dispcorr: -0.023953879 hartree
energy: -1658.129122689875
dipole: 15.24359 -15.67407 -0.43049 4.04442 -3.86969 0.17473 1.22978 -0.92852 0.30126
magnitude: 0.55372 au
magnitude: 1.40744 debye
