program: Orca
programVersion: 5.0.2
elementType: S P O O O O N N C C C C C C C C C C C C C H H H H H H H H H H H H H H H H H H H H H
charge: 0
multiplicity: 1
keywords: wb97x-d3
keywords: def2-TZVPP
keywords: def2/J RIJCOSX
keywords: DEFGRID2
keywords: scfconv7
keywords: smallprint printgap noloewdin
keywords: NOSOSCF
formula: C13H21N2O4PS
InChI: InChI=1/C13H21N2O4PS/c1-5-11(4)14-20(21,18-6-2)19-13-9-10(3)7-8-12(13)15(16)17/h7-9,11,14H,5-6H2,1-4H3
42 atoms
S  0.420601 2.124622 1.686701
P  0.696657 1.257993 -0.009812
O  -0.667375 0.755934 -0.789836
O  1.270604 2.189853 -1.171986
O  0.234761 -1.223615 -2.450315
O  -1.489215 -2.225404 -3.21581
N  1.61611 -0.092973 0.019687
N  -0.900454 -1.628736 -2.349861
C  2.680263 -0.370364 0.977709
C  2.54862 -1.798728 1.499995
C  4.049248 -0.100639 0.366645
C  1.225341 -2.067964 2.200793
C  -1.442942 -0.25765 -0.336593
C  0.834194 3.544725 -1.345194
C  -1.607473 -1.416857 -1.097194
C  -2.166024 -0.123527 0.839605
C  -3.022133 -1.1237 1.281969
C  -2.483535 -2.408959 -0.681632
C  -3.167434 -2.272562 0.50884
C  1.890231 4.504758 -0.850134
C  -3.8011 -0.9403 2.548577
H  2.52708 0.313019 1.816388
H  3.377124 -1.983328 2.18924
H  2.687451 -2.502032 0.671288
H  1.625544 -0.645298 -0.828963
H  4.237048 -0.7545 -0.48753
H  4.841968 -0.273283 1.095332
H  4.124957 0.930569 0.022329
H  1.201034 -3.075232 2.616383
H  1.064274 -1.364973 3.019193
H  0.381776 -1.969346 1.518181
H  -0.110242 3.719655 -0.824012
H  0.651731 3.670546 -2.412849
H  -2.050278 0.788115 1.411244
H  -2.616282 -3.293768 -1.287662
H  -3.830913 -3.063187 0.833724
H  1.581644 5.53054 -1.05396
H  2.84377 4.335688 -1.349885
H  2.034117 4.401299 0.224501
H  -4.693705 -0.339154 2.365581
H  -3.213307 -0.425412 3.307321
H  -4.127763 -1.893261 2.961648
totalener: -1658.10633006 hartree
nucrepener: 2208.07072719 hartree
electener: -3866.17705725 hartree
oneelecener: -6665.88352998 hartree
twoeener: 2799.70647273 hartree
kineticenergy: 1652.77563244 hartree
xcener: -123.708341935658 hartree
chargesum: -0.0000000
charge: -0.419361 0.676975 -0.342120 -0.325912 -0.353809 -0.321202 -0.255274 0.509130 0.050785 -0.097369 -0.247986 -0.222696 0.131079 0.030619 0.014003 -0.082855 -0.020811 -0.105888 -0.105715 -0.230198 -0.202228 0.069519 0.061575 0.058208 0.169624 0.078101 0.079975 0.091841 0.089053 0.078951 0.051680 0.076462 0.094818 0.126520 0.135624 0.116436 0.080362 0.083484 0.086533 0.106057 0.101471 0.084536
qa: -0.4194 0.6770 -0.3421 -0.3259 -0.3538 -0.3212 -0.2553 0.5091 0.0508 -0.0974 -0.2480 -0.2227 0.1311 0.0306 0.0140 -0.0829 -0.0208 -0.1059 -0.1057 -0.2302 -0.2022 0.0695 0.0616 0.0582 0.1696 0.0781 0.0800 0.0918 0.0891 0.0790 0.0517 0.0765 0.0948 0.1265 0.1356 0.1164 0.0804 0.0835 0.0865 0.1061 0.1015 0.0845
va: 2.0082 5.4597 2.1294 2.1229 1.8730 1.9255 3.1127 4.1202 3.8851 3.8646 3.9669 3.9389 4.0812 3.8908 3.8448 3.9095 3.8441 4.0519 3.9541 3.9218 3.9064 1.0379 1.0145 1.0140 1.0383 1.0074 1.0094 1.0124 1.0087 1.0098 1.0193 1.0133 0.9952 1.0326 1.0214 1.0074 1.0120 1.0052 1.0198 0.9940 1.0016 1.0062
dispcorr: -0.023018247 hartree
energy: -1658.129348305624
dipole: 11.47874 -11.87048 -0.39175 -0.30374 0.01630 -0.28744 15.45551 -14.59603 0.85948
magnitude: 0.98732 au
magnitude: 2.50956 debye
