program: Orca
programVersion: 5.0.2
elementType: F F F O O O O N N N C C C C C C C C C C C C C H H H H H H H H H H H H H H H H
charge: 0
multiplicity: 1
keywords: wb97x-d3
keywords: def2-TZVPP
keywords: def2/J RIJCOSX
keywords: DEFGRID2
keywords: scfconv7
keywords: smallprint printgap noloewdin
keywords: NOSOSCF
formula: C13H16F3N3O4
InChI: InChI=1/C13H16F3N3O4/c1-3-5-6-17(4-2)12-10(18(20)21)7-9(13(14,15)16)8-11(12)19(22)23/h7-8H,3-6H2,1-2H3
39 atoms
F  4.053335 1.314962 -0.951664
F  4.162446 -0.835749 -0.96411
F  4.381576 0.239892 0.881681
O  -1.214748 2.46567 1.61188
O  0.310565 -3.35035 0.964974
O  -0.297871 3.407069 -0.072355
O  -1.198788 -2.779978 -0.430906
N  -1.943678 -0.105954 0.481828
N  -0.532389 2.441963 0.615631
N  -0.262452 -2.530842 0.287591
C  -2.818696 0.836329 -0.211264
C  -3.911597 0.161089 -1.032439
C  -0.594552 -0.040846 0.359715
C  -2.578229 -1.022935 1.427357
C  -3.42239 -0.69586 -2.194982
C  0.110313 1.183313 0.268077
C  0.256114 -1.170934 0.301876
C  -3.455069 -0.301588 2.438992
C  2.231986 0.136265 -0.060948
C  1.461382 1.282396 0.004441
C  1.624299 -1.090356 0.136719
C  -2.510734 0.037254 -3.169027
C  3.707683 0.215844 -0.27618
H  -3.29019 1.52516 0.493128
H  -2.221343 1.440323 -0.893918
H  -4.532178 0.974138 -1.42088
H  -4.565886 -0.42868 -0.385775
H  -3.167623 -1.779342 0.90486
H  -1.801498 -1.542013 1.987532
H  -4.299969 -1.06098 -2.733594
H  -2.914104 -1.58487 -1.821269
H  -3.816768 -1.030395 3.164398
H  -2.897184 0.462237 2.980521
H  -4.329476 0.163359 1.984979
H  1.914983 2.261206 -0.077532
H  2.204852 -2.00268 0.098792
H  -2.976225 0.953763 -3.538249
H  -1.557006 0.312116 -2.714391
H  -2.282817 -0.585833 -4.034759
elementType: F O N C H
totalener: -1269.66489121 hartree
nucrepener: 2167.66949307 hartree
electener: -3437.33438428 hartree
oneelecener: -6047.44260244 hartree
twoeener: 2610.10821817 hartree
cpcmener: -0.02675086 hartree
kineticenergy: 1264.90256487 hartree
xcener: -113.624185624634 hartree
chargesum: 0.0000000
charge: -0.177879 -0.179626 -0.178909 -0.371364 -0.378977 -0.381316 -0.364468 -0.045462 0.552673 0.546315 -0.152617 -0.142136 0.041017 -0.050816 -0.119331 -0.051542 0.007192 -0.286041 -0.051810 -0.042196 -0.061367 -0.281556 0.545100 0.126847 0.124592 0.088433 0.082245 0.105846 0.108742 0.075007 0.071960 0.103718 0.089933 0.090450 0.151180 0.146379 0.086500 0.078493 0.094792
qa: -0.1779 -0.1796 -0.1789 -0.3714 -0.3790 -0.3813 -0.3645 -0.0455 0.5527 0.5463 -0.1526 -0.1421 0.0410 -0.0508 -0.1193 -0.0515 0.0072 -0.2860 -0.0518 -0.0422 -0.0614 -0.2816 0.5451 0.1268 0.1246 0.0884 0.0822 0.1058 0.1087 0.0750 0.0720 0.1037 0.0899 0.0904 0.1512 0.1464 0.0865 0.0785 0.0948
va: 1.1260 1.1245 1.1132 1.8654 1.8625 1.8581 1.8563 3.0570 4.0831 4.0835 3.8951 3.8885 4.2133 3.8594 3.8764 3.9109 3.8936 3.9419 3.8406 4.0693 4.0840 3.9354 4.4385 0.9902 0.9824 1.0085 1.0089 0.9861 0.9907 1.0110 1.0135 1.0043 1.0094 0.9996 1.0256 1.0301 1.0015 0.9945 1.0046
dispcorr: -0.022369845 hartree
energy: -1269.687261055318
dipole: -49.85165 48.80868 -1.04297 -2.44645 2.41858 -0.02788 -4.73979 4.68042 -0.05937
magnitude: 1.04503 au
magnitude: 2.65625 debye
