program: Orca
programVersion: 5.0.2
elementType: F F F O O O O N N N C C C C C C C C C C C C C H H H H H H H H H H H H H H H H
charge: 0
multiplicity: 1
keywords: wb97x-d3
keywords: def2-TZVPP
keywords: def2/J RIJCOSX
keywords: DEFGRID2
keywords: scfconv7
keywords: smallprint printgap noloewdin
keywords: NOSOSCF
formula: C13H16F3N3O4
InChI: InChI=1/C13H16F3N3O4/c1-3-5-6-17(4-2)12-10(18(20)21)7-9(13(14,15)16)8-11(12)19(22)23/h7-8H,3-6H2,1-2H3
39 atoms
F  3.694568 -0.810015 1.815807
F  3.8256 1.285979 1.341179
F  4.335698 -0.184444 -0.137168
O  -1.552919 2.716729 -0.083993
O  -0.288532 -3.331369 0.400919
O  0.106774 3.296686 -1.296925
O  -0.966053 -2.692612 -1.521296
N  -1.932073 -0.048568 -0.981172
N  -0.501962 2.491342 -0.632999
N  -0.443651 -2.489641 -0.452897
C  -2.975982 -0.721567 -0.210403
C  -3.52594 0.118067 0.937981
C  -0.640483 -0.003022 -0.55161
C  -2.380536 0.734233 -2.128837
C  -2.596066 0.266567 2.139655
C  0.112026 1.184836 -0.435654
C  0.088714 -1.159243 -0.193279
C  -2.892564 -0.145097 -3.259884
C  2.05954 0.067045 0.384371
C  1.430064 1.227543 -0.025713
C  1.374845 -1.134518 0.305292
C  -2.301612 -1.044258 2.854959
C  3.478848 0.092248 0.854233
H  -3.783679 -0.961306 -0.900248
H  -2.64531 -1.682827 0.179912
H  -4.451722 -0.363472 1.268762
H  -3.816959 1.102065 0.562002
H  -3.152905 1.448673 -1.832055
H  -1.542597 1.305361 -2.526186
H  -3.061743 0.959045 2.845359
H  -1.655945 0.74025 1.846369
H  -3.78631 -0.706772 -2.98714
H  -3.15544 0.487947 -4.108692
H  -2.128036 -0.849378 -3.588807
H  1.935978 2.182164 0.030871
H  1.858858 -2.065115 0.571916
H  -1.747885 -1.745571 2.229106
H  -1.701055 -0.874562 3.749436
H  -3.222726 -1.540945 3.166923
elementType: F O N C H
totalener: -1269.66276013 hartree
nucrepener: 2187.31199204 hartree
electener: -3456.97475218 hartree
oneelecener: -6086.73363258 hartree
twoeener: 2629.75888040 hartree
cpcmener: -0.02743203 hartree
kineticenergy: 1264.88708058 hartree
xcener: -113.618719827130 hartree
chargesum: 0.0000000
charge: -0.177806 -0.177596 -0.178229 -0.362544 -0.374263 -0.375707 -0.367106 -0.064301 0.552243 0.561586 -0.103709 -0.146619 -0.044849 -0.025817 -0.067530 0.030835 -0.045731 -0.286369 -0.034479 -0.055670 -0.059937 -0.290890 0.542700 0.117101 0.110568 0.084454 0.078301 0.101481 0.099416 0.079877 0.050821 0.089339 0.100920 0.081933 0.148192 0.150482 0.078761 0.093800 0.086341
qa: -0.1778 -0.1776 -0.1782 -0.3625 -0.3743 -0.3757 -0.3671 -0.0643 0.5522 0.5616 -0.1037 -0.1466 -0.0448 -0.0258 -0.0675 0.0308 -0.0457 -0.2864 -0.0345 -0.0557 -0.0599 -0.2909 0.5427 0.1171 0.1106 0.0845 0.0783 0.1015 0.0994 0.0799 0.0508 0.0893 0.1009 0.0819 0.1482 0.1505 0.0788 0.0938 0.0863
va: 1.1254 1.1282 1.1150 1.8721 1.8609 1.8624 1.8658 3.0697 4.0971 4.0871 3.8831 3.8830 4.2679 3.8589 3.8428 3.8321 3.8459 3.9396 3.8361 4.0818 4.0910 3.9453 4.4401 1.0021 0.9951 1.0130 1.0153 0.9947 0.9943 1.0051 1.0173 1.0046 1.0058 1.0107 1.0277 1.0262 0.9993 1.0034 1.0041
dispcorr: -0.023388605 hartree
energy: -1269.686148739133
dipole: -44.87072 44.08534 -0.78538 -2.52651 2.64104 0.11453 -2.25901 2.16804 -0.09097
magnitude: 0.79888 au
magnitude: 2.03059 debye
