program: Orca
programVersion: 5.0.2
elementType: F F F O O O O N N N C C C C C C C C C C C C C H H H H H H H H H H H H H H H H
charge: 0
multiplicity: 1
keywords: wb97x-d3
keywords: def2-TZVPP
keywords: def2/J RIJCOSX
keywords: DEFGRID2
keywords: scfconv7
keywords: smallprint printgap noloewdin
keywords: NOSOSCF
formula: C13H16F3N3O4
InChI: InChI=1/C13H16F3N3O4/c1-3-5-6-17(4-2)12-10(18(20)21)7-9(13(14,15)16)8-11(12)19(22)23/h7-8H,3-6H2,1-2H3
39 atoms
F  4.31415 0.68811 -0.240095
F  4.089286 -1.117585 0.908486
F  3.734791 0.798886 1.822243
O  0.024208 3.376753 -0.877529
O  -0.069641 -3.43689 -0.066435
O  -1.568526 2.62015 0.326549
O  -0.913442 -2.532431 -1.807146
N  -1.941205 -0.035743 -0.778843
N  -0.537466 2.485534 -0.286504
N  -0.327703 -2.475066 -0.75283
C  -2.879234 -0.973057 -0.166488
C  -2.622167 -1.294353 1.30132
C  -0.61583 -0.015102 -0.481785
C  -2.493427 0.80272 -1.839015
C  -2.554419 -0.094413 2.239664
C  0.112662 1.180709 -0.27096
C  0.164894 -1.177949 -0.319639
C  -3.013884 -0.012846 -3.01232
C  2.132526 0.028207 0.294068
C  1.447608 1.21213 0.063505
C  1.479893 -1.173026 0.112457
C  -3.787388 0.794746 2.202832
C  3.568777 0.091573 0.698432
H  -3.854627 -0.487518 -0.240994
H  -2.978956 -1.902386 -0.734437
H  -1.724659 -1.900856 1.437775
H  -3.450003 -1.941728 1.604264
H  -3.295465 1.425328 -1.435312
H  -1.720976 1.466533 -2.224164
H  -1.661021 0.499983 2.034362
H  -2.419984 -0.476427 3.254627
H  -3.822479 -0.68421 -2.726957
H  -3.406138 0.667222 -3.768799
H  -2.219678 -0.600644 -3.470002
H  1.93773 2.166654 0.210823
H  2.000275 -2.112788 0.235966
H  -3.71205 1.594753 2.940226
H  -3.933742 1.265954 1.230123
H  -4.690968 0.224754 2.428243
elementType: F O N C H
totalener: -1269.66357849 hartree
nucrepener: 2187.81369755 hartree
electener: -3457.47727604 hartree
oneelecener: -6087.84213556 hartree
twoeener: 2630.36485952 hartree
cpcmener: -0.02675542 hartree
kineticenergy: 1264.90716530 hartree
xcener: -113.624701122234 hartree
chargesum: -0.0000000
charge: -0.180144 -0.176328 -0.180141 -0.373918 -0.378583 -0.358852 -0.372033 -0.032144 0.543980 0.564172 -0.164161 -0.122481 -0.005159 -0.007005 -0.114904 0.002967 -0.084560 -0.285168 -0.057555 -0.063849 -0.029310 -0.282484 0.552691 0.113427 0.124896 0.090544 0.090646 0.093899 0.098070 0.064595 0.081750 0.092879 0.103637 0.085576 0.150395 0.151077 0.097461 0.075987 0.090130
qa: -0.1801 -0.1763 -0.1801 -0.3739 -0.3786 -0.3589 -0.3720 -0.0321 0.5440 0.5642 -0.1642 -0.1225 -0.0052 -0.0070 -0.1149 0.0030 -0.0846 -0.2852 -0.0576 -0.0638 -0.0293 -0.2825 0.5527 0.1134 0.1249 0.0905 0.0906 0.0939 0.0981 0.0646 0.0817 0.0929 0.1036 0.0856 0.1504 0.1511 0.0975 0.0760 0.0901
va: 1.1184 1.1307 1.1216 1.8639 1.8579 1.8708 1.8637 3.0124 4.1025 4.0784 3.8904 3.8624 4.2542 3.8392 3.8699 3.8688 3.9247 3.9334 3.8594 4.1179 4.0215 3.9270 4.4364 0.9851 0.9951 1.0151 1.0132 0.9978 0.9958 1.0129 1.0102 0.9995 1.0054 1.0113 1.0261 1.0273 1.0042 0.9983 1.0022
dispcorr: -0.023402289 hartree
energy: -1269.686980779126
dipole: -47.94565 47.11676 -0.82889 -1.04154 0.99472 -0.04683 -1.39505 1.40624 0.01120
magnitude: 0.83029 au
magnitude: 2.11042 debye
