program: Orca
programVersion: 5.0.2
elementType: F F F O O O O N N N C C C C C C C C C C C C C H H H H H H H H H H H H H H H H
charge: 0
multiplicity: 1
keywords: wb97x-d3
keywords: def2-TZVPP
keywords: def2/J RIJCOSX
keywords: DEFGRID2
keywords: scfconv7
keywords: smallprint printgap noloewdin
keywords: NOSOSCF
formula: C13H16F3N3O4
InChI: InChI=1/C13H16F3N3O4/c1-3-5-6-17(4-2)12-10(18(20)21)7-9(13(14,15)16)8-11(12)19(22)23/h7-8H,3-6H2,1-2H3
39 atoms
F  4.421201 1.149851 -0.402658
F  4.439936 -0.982112 -0.09748
F  4.121391 0.341217 1.564404
O  0.080999 3.359025 -1.039559
O  0.067805 -3.322315 0.519363
O  -1.384923 2.627982 0.33128
O  -0.915725 -2.686951 -1.269456
N  -1.812843 -0.075648 -0.49691
N  -0.406789 2.484905 -0.361745
N  -0.228545 -2.484019 -0.298082
C  -2.643136 -0.880785 0.388034
C  -3.690087 -0.052328 1.124692
C  -0.465039 -0.005722 -0.323582
C  -2.495514 0.584835 -1.605605
C  -4.504631 -0.925638 2.070623
C  0.26871 1.197114 -0.334451
C  0.335293 -1.150565 -0.131548
C  -1.68093 0.639298 -2.885836
C  2.363078 0.099329 0.02993
C  1.644578 1.256698 -0.207949
C  1.694648 -1.112627 0.091322
C  -5.606044 -0.15448 2.780739
C  3.838701 0.153366 0.268582
H  -3.141492 -1.674419 -0.178251
H  -2.012194 -1.358512 1.139664
H  -4.360897 0.43219 0.409432
H  -3.195175 0.743755 1.687161
H  -3.384398 -0.018576 -1.800202
H  -2.864665 1.579588 -1.341024
H  -3.836924 -1.376089 2.810872
H  -4.943367 -1.75685 1.510807
H  -0.818235 1.303156 -2.836469
H  -1.329961 -0.353119 -3.169139
H  -2.31722 1.012838 -3.687788
H  2.138587 2.219075 -0.231555
H  2.234004 -2.038281 0.242766
H  -6.324735 0.255671 2.0692
H  -6.155501 -0.793815 3.472635
H  -5.200063 0.679381 3.356087
elementType: F O N C H
totalener: -1269.66395349 hartree
nucrepener: 2131.31282413 hartree
electener: -3400.97677762 hartree
oneelecener: -5974.85047071 hartree
twoeener: 2573.87369309 hartree
cpcmener: -0.02626513 hartree
kineticenergy: 1264.90384516 hartree
xcener: -113.619774716044 hartree
chargesum: -0.0000000
charge: -0.177090 -0.178286 -0.177996 -0.375387 -0.373028 -0.369225 -0.363895 -0.069204 0.562225 0.547291 -0.070112 -0.117269 0.033817 -0.074074 -0.082406 -0.100389 0.003076 -0.249824 -0.042093 -0.041801 -0.049038 -0.285595 0.543791 0.100974 0.104973 0.075445 0.066149 0.095783 0.104941 0.064411 0.058376 0.093200 0.090312 0.102855 0.149977 0.148580 0.080136 0.090750 0.079652
qa: -0.1771 -0.1783 -0.1780 -0.3754 -0.3730 -0.3692 -0.3639 -0.0692 0.5622 0.5473 -0.0701 -0.1173 0.0338 -0.0741 -0.0824 -0.1004 0.0031 -0.2498 -0.0421 -0.0418 -0.0490 -0.2856 0.5438 0.1010 0.1050 0.0754 0.0661 0.0958 0.1049 0.0644 0.0584 0.0932 0.0903 0.1029 0.1500 0.1486 0.0801 0.0908 0.0797
va: 1.1276 1.1267 1.1145 1.8623 1.8642 1.8660 1.8777 3.0449 4.0789 4.1040 3.8585 3.8649 4.2312 3.8688 3.8797 3.9491 3.9093 3.9326 3.8507 4.0759 4.0865 3.9502 4.4358 1.0007 0.9952 1.0084 1.0224 0.9939 0.9900 1.0066 1.0097 1.0025 1.0090 1.0075 1.0268 1.0275 1.0006 1.0039 1.0000
dispcorr: -0.020964876 hartree
energy: -1269.684918367368
dipole: -54.79612 54.08928 -0.70685 -1.65169 1.51978 -0.13191 2.25015 -2.36524 -0.11509
magnitude: 0.72820 au
magnitude: 1.85094 debye
