program: Orca
programVersion: 5.0.2
elementType: F F F O O O O N N N C C C C C C C C C C C C C H H H H H H H H H H H H H H H H
charge: 0
multiplicity: 1
keywords: wb97x-d3
keywords: def2-TZVPP
keywords: def2/J RIJCOSX
keywords: DEFGRID2
keywords: scfconv7
keywords: smallprint printgap noloewdin
keywords: NOSOSCF
formula: C13H16F3N3O4
InChI: InChI=1/C13H16F3N3O4/c1-3-5-6-17(4-2)12-10(18(20)21)7-9(13(14,15)16)8-11(12)19(22)23/h7-8H,3-6H2,1-2H3
39 atoms
F  4.27402 1.23772 -0.292241
F  4.392681 -0.885017 0.05365
F  3.964561 0.450607 1.682204
O  -0.101532 3.267745 -1.021694
O  0.118429 -3.442916 0.350456
O  -1.569277 2.519153 0.335696
O  -0.812534 -2.767463 -1.451659
N  -1.897501 -0.220723 -0.564233
N  -0.578042 2.389701 -0.34084
N  -0.185685 -2.578824 -0.437128
C  -2.723238 -1.208126 0.124974
C  -3.882956 -0.583794 0.894195
C  -0.559339 -0.113462 -0.346001
C  -2.555431 0.48936 -1.663465
C  -3.470524 0.127629 2.175098
C  0.129439 1.119363 -0.293858
C  0.292295 -1.227841 -0.177321
C  -1.72078 0.569651 -2.930222
C  2.259524 0.098917 0.106731
C  1.494887 1.230466 -0.113776
C  1.642441 -1.139767 0.093284
C  -4.665475 0.659291 2.951314
C  3.72462 0.223931 0.383713
H  -3.116097 -1.929215 -0.597097
H  -2.11988 -1.757831 0.848686
H  -4.565275 -1.402189 1.144101
H  -4.45238 0.091627 0.248741
H  -3.450742 -0.090261 -1.89034
H  -2.915223 1.478051 -1.369719
H  -2.788711 0.949001 1.949169
H  -2.909336 -0.570363 2.80396
H  -1.393091 -0.421884 -3.243275
H  -2.334718 0.988678 -3.72731
H  -0.840202 1.205743 -2.844119
H  1.946387 2.213673 -0.091915
H  2.216488 -2.048014 0.221134
H  -4.354617 1.158187 3.870364
H  -5.234229 1.38106 2.361447
H  -5.346946 -0.147686 3.229232
elementType: F O N C H
totalener: -1269.66345170 hartree
nucrepener: 2154.02894094 hartree
electener: -3423.69239263 hartree
oneelecener: -6020.29575758 hartree
twoeener: 2596.60336495 hartree
cpcmener: -0.02581681 hartree
kineticenergy: 1264.88184979 hartree
xcener: -113.616689215851 hartree
chargesum: 0.0000000
charge: -0.177989 -0.178035 -0.178268 -0.373850 -0.375601 -0.368634 -0.364189 -0.043880 0.565804 0.542185 -0.090535 -0.143149 0.003851 -0.069986 -0.081277 -0.077436 -0.012289 -0.245565 -0.050437 -0.032567 -0.042972 -0.285152 0.543787 0.112744 0.110977 0.082165 0.075167 0.093587 0.108603 0.064779 0.057213 0.088789 0.102724 0.092415 0.147577 0.148701 0.090707 0.079855 0.080182
qa: -0.1780 -0.1780 -0.1783 -0.3738 -0.3756 -0.3686 -0.3642 -0.0439 0.5658 0.5422 -0.0905 -0.1431 0.0039 -0.0700 -0.0813 -0.0774 -0.0123 -0.2456 -0.0504 -0.0326 -0.0430 -0.2852 0.5438 0.1127 0.1110 0.0822 0.0752 0.0936 0.1086 0.0648 0.0572 0.0888 0.1027 0.0924 0.1476 0.1487 0.0907 0.0799 0.0802
va: 1.1255 1.1273 1.1143 1.8651 1.8602 1.8624 1.8739 3.0460 4.0799 4.1031 3.9101 3.8905 4.2620 3.8654 3.8389 3.9152 3.9381 3.9252 3.8522 4.0591 4.0676 3.9468 4.4353 0.9999 0.9932 1.0106 1.0060 0.9966 0.9914 1.0199 1.0104 1.0096 1.0080 1.0036 1.0276 1.0273 1.0035 1.0003 1.0006
dispcorr: -0.021787511 hartree
energy: -1269.685239210175
dipole: -50.92190 50.10322 -0.81868 0.02814 -0.21828 -0.19014 1.45564 -1.61493 -0.15930
magnitude: 0.85543 au
magnitude: 2.17433 debye
