program: Orca
programVersion: 5.0.2
elementType: F F F O O O O N N N C C C C C C C C C C C C C H H H H H H H H H H H H H H H H
charge: 0
multiplicity: 1
keywords: wb97x-d3
keywords: def2-TZVPP
keywords: def2/J RIJCOSX
keywords: DEFGRID2
keywords: scfconv7
keywords: smallprint printgap noloewdin
keywords: NOSOSCF
formula: C13H16F3N3O4
InChI: InChI=1/C13H16F3N3O4/c1-3-5-6-17(4-2)12-10(18(20)21)7-9(13(14,15)16)8-11(12)19(22)23/h7-8H,3-6H2,1-2H3
39 atoms
F  4.086639 1.359894 -1.192925
F  4.368053 -0.771671 -1.100255
F  4.495322 0.409964 0.689032
O  -1.048888 1.925552 2.086879
O  0.333739 -3.520895 -0.260091
O  -0.214433 3.238488 0.621214
O  -1.14816 -2.473672 -1.390378
N  -1.780646 -0.318231 0.46042
N  -0.39897 2.143391 1.095167
N  -0.202692 -2.508519 -0.641857
C  -2.732284 0.653282 -0.064959
C  -3.676207 0.033701 -1.092536
C  -0.443401 -0.191579 0.232794
C  -2.343588 -1.415507 1.242136
C  -4.655641 1.04727 -1.679917
C  0.260232 1.012159 0.453626
C  0.376413 -1.239994 -0.222144
C  -1.495287 -1.817481 2.435215
C  2.359037 0.09578 -0.234136
C  1.602135 1.179522 0.18848
C  1.742359 -1.128096 -0.408477
C  -5.648619 1.617427 -0.675521
C  3.828241 0.26897 -0.463156
H  -3.299421 1.093349 0.760108
H  -2.194648 1.462586 -0.562246
H  -4.239494 -0.788526 -0.641194
H  -3.078148 -0.399665 -1.897582
H  -3.296635 -1.041745 1.62135
H  -2.592287 -2.289488 0.632988
H  -5.208517 0.558085 -2.485545
H  -4.098502 1.862952 -2.150877
H  -1.295112 -0.960481 3.078698
H  -2.041815 -2.556533 3.021279
H  -0.54116 -2.271982 2.168879
H  2.065589 2.140902 0.373391
H  2.301624 -1.988895 -0.749694
H  -5.164497 2.232652 0.084013
H  -6.388596 2.24676 -1.172099
H  -6.19004 0.82184 -0.1593
elementType: F O N C H
totalener: -1269.67355526 hartree
nucrepener: 2137.92810738 hartree
electener: -3407.60166264 hartree
oneelecener: -5988.11635857 hartree
twoeener: 2580.51469593 hartree
cpcmener: -0.02244151 hartree
kineticenergy: 1264.88486137 hartree
xcener: -113.614770738197 hartree
chargesum: 0.0000000
charge: -0.178243 -0.176020 -0.177228 -0.350510 -0.359847 -0.362036 -0.354463 -0.068487 0.528792 0.543177 -0.091892 -0.115164 0.015324 -0.068779 -0.113780 0.001386 -0.076094 -0.248825 -0.048325 -0.072515 -0.030480 -0.276795 0.546760 0.114497 0.102326 0.078995 0.077912 0.093196 0.100341 0.072157 0.059766 0.088962 0.100940 0.091275 0.150091 0.149119 0.080864 0.092710 0.080894
qa: -0.1782 -0.1760 -0.1772 -0.3505 -0.3598 -0.3620 -0.3545 -0.0685 0.5288 0.5432 -0.0919 -0.1152 0.0153 -0.0688 -0.1138 0.0014 -0.0761 -0.2488 -0.0483 -0.0725 -0.0305 -0.2768 0.5468 0.1145 0.1023 0.0790 0.0779 0.0932 0.1003 0.0722 0.0598 0.0890 0.1009 0.0913 0.1501 0.1491 0.0809 0.0927 0.0809
va: 1.1242 1.1307 1.1195 1.8890 1.8782 1.8750 1.8785 3.0367 4.1280 4.1071 3.8506 3.8551 4.2453 3.8720 3.9089 3.9096 3.9232 3.9333 3.8623 4.1199 4.0302 3.9279 4.4370 0.9943 0.9959 1.0093 1.0255 0.9946 0.9924 1.0064 1.0079 1.0096 1.0079 1.0044 1.0252 1.0261 1.0005 1.0041 1.0009
dispcorr: -0.021425808 hartree
energy: -1269.694981071286
dipole: -54.64359 53.89687 -0.74672 -0.73903 0.67514 -0.06388 3.39417 -3.31591 0.07826
magnitude: 0.75353 au
magnitude: 1.91531 debye
