program: Orca
programVersion: 5.0.2
elementType: F F F O O O O N N N C C C C C C C C C C C C C H H H H H H H H H H H H H H H H
charge: 0
multiplicity: 1
keywords: wb97x-d3
keywords: def2-TZVPP
keywords: def2/J RIJCOSX
keywords: DEFGRID2
keywords: scfconv7
keywords: smallprint printgap noloewdin
keywords: NOSOSCF
formula: C13H16F3N3O4
InChI: InChI=1/C13H16F3N3O4/c1-3-5-6-17(4-2)12-10(18(20)21)7-9(13(14,15)16)8-11(12)19(22)23/h7-8H,3-6H2,1-2H3
39 atoms
F  4.420088 1.154868 -0.398581
F  4.44167 -0.977109 -0.091579
F  4.123616 0.347764 1.569797
O  0.065969 3.345047 -1.067223
O  0.067759 -3.32208 0.519032
O  -1.374557 2.637153 0.342959
O  -0.90374 -2.688965 -1.276389
N  -1.812854 -0.076582 -0.49983
N  -0.40974 2.484695 -0.364961
N  -0.224478 -2.485973 -0.300876
C  -2.648141 -0.885147 0.378062
C  -3.685658 -0.056382 1.128521
C  -0.46499 -0.006599 -0.32172
C  -2.491105 0.594982 -1.604853
C  -4.506315 -0.928046 2.071771
C  0.267521 1.197039 -0.327168
C  0.3369 -1.150961 -0.131704
C  -1.685794 0.629825 -2.892088
C  2.363511 0.102007 0.037249
C  1.642666 1.258987 -0.197783
C  1.696298 -1.110919 0.093138
C  -5.604163 -0.153199 2.784116
C  3.839827 0.158106 0.274674
H  -3.153669 -1.667323 -0.19784
H  -2.020252 -1.379416 1.121485
H  -4.355262 0.441397 0.420768
H  -3.180983 0.730977 1.695063
H  -3.393806 0.009908 -1.790882
H  -2.837852 1.598008 -1.34072
H  -3.842444 -1.385027 2.812168
H  -4.950595 -1.755934 1.510362
H  -0.814134 1.282988 -2.853462
H  -1.349949 -0.368876 -3.172259
H  -2.322069 1.006626 -3.693184
H  2.135087 2.222429 -0.223132
H  2.236668 -2.036296 0.243682
H  -6.322234 0.262414 2.074438
H  -6.157269 -0.79167 3.474543
H  -5.195623 0.677688 3.362669
elementType: F O N C H
totalener: -1269.67476992 hartree
nucrepener: 2130.64696885 hartree
electener: -3400.32173878 hartree
oneelecener: -5973.57267165 hartree
twoeener: 2573.25093287 hartree
cpcmener: -0.02239335 hartree
kineticenergy: 1264.89449361 hartree
xcener: -113.616087325227 hartree
chargesum: -0.0000000
charge: -0.176205 -0.177440 -0.176503 -0.363137 -0.362241 -0.357487 -0.352479 -0.065394 0.547692 0.533744 -0.074433 -0.113929 0.024306 -0.076309 -0.083090 -0.092079 0.003233 -0.249327 -0.041183 -0.047737 -0.055635 -0.282167 0.543153 0.100931 0.102858 0.073637 0.066845 0.093836 0.104911 0.064153 0.057741 0.092676 0.090369 0.101738 0.148423 0.147135 0.079457 0.090404 0.079532
qa: -0.1762 -0.1774 -0.1765 -0.3631 -0.3622 -0.3575 -0.3525 -0.0654 0.5477 0.5337 -0.0744 -0.1139 0.0243 -0.0763 -0.0831 -0.0921 0.0032 -0.2493 -0.0412 -0.0477 -0.0556 -0.2822 0.5432 0.1009 0.1029 0.0736 0.0668 0.0938 0.1049 0.0642 0.0577 0.0927 0.0904 0.1017 0.1484 0.1471 0.0795 0.0904 0.0795
va: 1.1287 1.1277 1.1166 1.8752 1.8748 1.8769 1.8886 3.0449 4.1003 4.1229 3.8646 3.8600 4.2366 3.8716 3.8809 3.9422 3.9131 3.9323 3.8521 4.0786 4.0897 3.9508 4.4364 1.0007 0.9961 1.0088 1.0228 0.9937 0.9905 1.0066 1.0097 1.0036 1.0095 1.0078 1.0274 1.0285 1.0009 1.0040 1.0002
dispcorr: -0.020973520 hartree
energy: -1269.695743441958
dipole: -54.81683 54.07428 -0.74255 -1.68108 1.57207 -0.10901 2.22156 -2.32521 -0.10365
magnitude: 0.75764 au
magnitude: 1.92576 debye
