program: Orca
programVersion: 5.0.2
elementType: F F F O O O O N N N C C C C C C C C C C C C C H H H H H H H H H H H H H H H H
charge: 0
multiplicity: 1
keywords: wb97x-d3
keywords: def2-TZVPP
keywords: def2/J RIJCOSX
keywords: DEFGRID2
keywords: scfconv7
keywords: smallprint printgap noloewdin
keywords: NOSOSCF
formula: C13H16F3N3O4
InChI: InChI=1/C13H16F3N3O4/c1-3-5-6-17(4-2)12-10(18(20)21)7-9(13(14,15)16)8-11(12)19(22)23/h7-8H,3-6H2,1-2H3
39 atoms
F  4.409305 1.175308 -0.384149
F  4.412336 -0.963528 -0.098443
F  4.100263 0.34893 1.575768
O  0.062264 3.339932 -1.222728
O  0.0198 -3.240052 0.646857
O  -1.319764 2.750675 0.306627
O  -0.99927 -2.638229 -1.141237
N  -1.835501 -0.000825 -0.435352
N  -0.396151 2.54535 -0.43881
N  -0.289304 -2.429405 -0.191115
C  -2.658578 -0.723968 0.520745
C  -3.589198 0.199676 1.302423
C  -0.480553 0.056298 -0.288157
C  -2.528334 0.635823 -1.546588
C  -4.380734 -0.53498 2.380671
C  0.265252 1.24654 -0.348642
C  0.301386 -1.096096 -0.075523
C  -1.758344 0.581168 -2.856042
C  2.348498 0.133066 0.038791
C  1.642588 1.289399 -0.239866
C  1.662176 -1.066349 0.141708
C  -5.364789 -1.566279 1.842466
C  3.826468 0.175087 0.279241
H  -3.227761 -1.501305 0.001884
H  -2.013855 -1.229477 1.243264
H  -4.284917 0.697696 0.620118
H  -2.98857 0.988942 1.758177
H  -3.452364 0.067798 -1.677613
H  -2.838084 1.66019 -1.319203
H  -4.926077 0.206471 2.968764
H  -3.688357 -1.016007 3.07853
H  -1.47709 -0.443701 -3.094646
H  -2.391377 0.95662 -3.659391
H  -0.856336 1.192308 -2.858267
H  2.149328 2.241187 -0.32559
H  2.188181 -1.992436 0.330447
H  -4.864747 -2.402065 1.352129
H  -5.969147 -1.984966 2.64694
H  -6.048624 -1.120188 1.117933
totalener: -1269.66059541 hartree
nucrepener: 2140.40251306 hartree
electener: -3410.06310847 hartree
oneelecener: -5993.50669390 hartree
twoeener: 2583.44358543 hartree
kineticenergy: 1264.94606088 hartree
xcener: -113.621293925809 hartree
chargesum: -0.0000000
charge: -0.166477 -0.168456 -0.162158 -0.312523 -0.314383 -0.312663 -0.308152 -0.044029 0.497941 0.488771 -0.133348 -0.101799 0.004394 -0.096231 -0.112769 -0.098908 -0.016211 -0.241751 -0.042286 -0.063994 -0.081495 -0.258471 0.535879 0.115822 0.094794 0.070361 0.089223 0.082430 0.108826 0.073569 0.057871 0.097565 0.093543 0.093754 0.144019 0.142923 0.076702 0.090312 0.077405
qa: -0.1665 -0.1685 -0.1622 -0.3125 -0.3144 -0.3127 -0.3082 -0.0440 0.4979 0.4888 -0.1333 -0.1018 0.0044 -0.0962 -0.1128 -0.0989 -0.0162 -0.2418 -0.0423 -0.0640 -0.0815 -0.2585 0.5359 0.1158 0.0948 0.0704 0.0892 0.0824 0.1088 0.0736 0.0579 0.0976 0.0935 0.0938 0.1440 0.1429 0.0767 0.0903 0.0774
va: 1.1416 1.1390 1.1363 1.9148 1.9115 1.9050 1.9190 2.9948 4.1400 4.1567 3.8827 3.8359 4.2120 3.8946 3.9052 4.0029 3.9682 3.9331 3.8872 4.0764 4.1156 3.9277 4.4471 0.9953 0.9969 1.0125 1.0283 0.9942 0.9884 1.0079 1.0092 1.0090 1.0110 1.0056 1.0313 1.0327 1.0037 1.0067 1.0026
dispcorr: -0.021483082 hartree
energy: -1269.682078494191
dipole: -53.97050 53.22949 -0.74101 -4.11034 4.09944 -0.01090 1.03427 -1.05798 -0.02371
magnitude: 0.74147 au
magnitude: 1.88466 debye
