program: Orca
programVersion: 5.0.2
elementType: F F F O O O O N N N C C C C C C C C C C C C C H H H H H H H H H H H H H H H H
charge: 0
multiplicity: 1
keywords: wb97x-d3
keywords: def2-TZVPP
keywords: def2/J RIJCOSX
keywords: DEFGRID2
keywords: scfconv7
keywords: smallprint printgap noloewdin
keywords: NOSOSCF
formula: C13H16F3N3O4
InChI: InChI=1/C13H16F3N3O4/c1-3-5-6-17(4-2)12-10(18(20)21)7-9(13(14,15)16)8-11(12)19(22)23/h7-8H,3-6H2,1-2H3
39 atoms
F  4.321796 0.720787 -0.206141
F  4.094766 -1.125081 0.881163
F  3.703235 0.762004 1.847685
O  0.024147 3.373189 -0.877301
O  -0.080637 -3.432986 -0.068063
O  -1.567178 2.608539 0.335781
O  -0.911577 -2.529785 -1.824462
N  -1.941085 -0.030118 -0.778501
N  -0.541169 2.488815 -0.283255
N  -0.333833 -2.482764 -0.76772
C  -2.877633 -0.960854 -0.16143
C  -2.613695 -1.279367 1.306921
C  -0.610548 -0.015751 -0.485859
C  -2.482037 0.797954 -1.847865
C  -2.561103 -0.078656 2.246661
C  0.113617 1.179605 -0.271569
C  0.167376 -1.179852 -0.338498
C  -3.007371 -0.022175 -3.018517
C  2.139949 0.024379 0.275333
C  1.452064 1.207437 0.050931
C  1.482861 -1.174816 0.091125
C  -3.813651 0.78388 2.227964
C  3.573245 0.087931 0.701119
H  -3.852749 -0.471494 -0.227842
H  -2.978205 -1.89101 -0.728867
H  -1.707413 -1.874344 1.436064
H  -3.427979 -1.942214 1.614906
H  -3.273327 1.440938 -1.452045
H  -1.699245 1.45265 -2.230324
H  -1.692232 0.542673 2.023993
H  -2.399564 -0.458733 3.258421
H  -3.837304 -0.667528 -2.732993
H  -3.371478 0.649941 -3.795858
H  -2.224503 -0.647017 -3.444101
H  1.943011 2.163274 0.18058
H  1.997551 -2.116377 0.221891
H  -3.754715 1.56764 2.982525
H  -3.953354 1.281542 1.268453
H  -4.708363 0.193529 2.435577
totalener: -1269.66061227 hartree
nucrepener: 2187.23210829 hartree
electener: -3456.89272056 hartree
oneelecener: -6087.14072027 hartree
twoeener: 2630.24799971 hartree
kineticenergy: 1264.94414880 hartree
xcener: -113.624465898354 hartree
chargesum: -0.0000000
charge: -0.165326 -0.167382 -0.166402 -0.312232 -0.316699 -0.303849 -0.318642 -0.000900 0.486303 0.506652 -0.195453 -0.143127 -0.016056 -0.052195 -0.102382 -0.027312 -0.102671 -0.248420 -0.061855 -0.081935 -0.058013 -0.261686 0.545438 0.101936 0.132259 0.098678 0.086266 0.097031 0.087927 0.070035 0.080376 0.080289 0.095903 0.095523 0.134392 0.152765 0.091725 0.076081 0.082956
qa: -0.1653 -0.1674 -0.1664 -0.3122 -0.3167 -0.3038 -0.3186 -0.0009 0.4863 0.5067 -0.1955 -0.1431 -0.0161 -0.0522 -0.1024 -0.0273 -0.1027 -0.2484 -0.0619 -0.0819 -0.0580 -0.2617 0.5454 0.1019 0.1323 0.0987 0.0863 0.0970 0.0879 0.0700 0.0804 0.0803 0.0959 0.0955 0.1344 0.1528 0.0917 0.0761 0.0830
va: 1.1394 1.1425 1.1389 1.9127 1.9110 1.9066 1.9014 2.9560 4.1535 4.1303 3.9214 3.8859 4.2199 3.8857 3.8612 3.9391 3.9790 3.9227 3.8996 4.1450 4.0231 3.9355 4.4482 0.9850 0.9927 1.0172 1.0145 0.9953 0.9981 1.0153 1.0093 1.0042 1.0076 1.0128 1.0357 1.0295 1.0090 1.0017 1.0034
dispcorr: -0.023390470 hartree
energy: -1269.684002737396
dipole: -47.90486 47.15945 -0.74541 -1.00140 0.95289 -0.04851 -1.38457 1.36552 -0.01905
magnitude: 0.74723 au
magnitude: 1.89931 debye
