program: Gaussian 09
title: 000059183
version: EM64L-G09RevD.01
frameworkgroup: C1[X(C18H14N2O2S)]
method: RPBEPBE
basis: SDD
operation: Freq
keyword: #p
keyword: freq=noraman
keyword: PBEPBE/SDD
title: #p freq=noraman PBEPBE/SDD
converged: YES YES NO NO
title: Mulliken charges:
elementType: S O O N N C C C C C C C C C C C C C C C C C C H H H H H H H H H H H H H H
charge: 0.228600 -0.434403 -0.314995 -0.455830 -0.083044 0.431544 -0.244146 0.101640 -0.447344 -0.324356 -0.242199 -0.173934 0.063470 -0.168106 -0.229815 -0.202836 -0.192060 -0.275654 -0.313176 0.154715 -0.227614 -0.208646 -0.241194 0.373174 0.238781 0.318129 0.252609 0.261857 0.283181 0.237769 0.265039 0.247793 0.244357 0.228543 0.228527 0.229541 0.390079
chargesum: 0.00000
title: Mulliken charges with hydrogens summed into heavy atoms:
elementType: S O O N N C C C C C C C C C C C C C C C C C C
charge: 0.228600 -0.044324 -0.314995 -0.082656 -0.083044 0.431544 -0.244146 0.101640 -0.208563 -0.006227 0.010411 0.087924 0.063470 -0.168106 0.053366 0.034933 0.072979 -0.027860 -0.068819 0.154715 0.000930 0.019881 -0.011653
polarizability: 4.43374731e+02 -1.67098172e+00 2.42088877e+02 2.15874345e+01 -4.45871089e+00 1.31600954e+02
1716.lowfreq: -18.0777 -2.7422 -0.5335 0.0013 0.0017 0.0018 8.9622 21.4032 27.8782
frequency: -5.7027 20.4187 27.8081 43.8006 62.5550 81.6981 96.4177 117.2827 155.2365 159.1375 193.1301 215.8741 238.9406 256.1241 293.5247 324.5876 339.0030 399.1535 401.3612 409.2055 418.3066 427.3027 433.8877 478.6156 513.0340 520.5567 534.8637 573.3070 601.4896 602.6089 609.9344 633.0796 671.8689 677.7005 693.4402 695.7112 718.5949 747.0961 758.4178 768.0317 808.0495 811.6373 822.9570 843.6778 858.4459 884.2701 904.1878 911.4560 952.0284 956.7876 972.7128 984.0699 986.0619 990.8950 995.4902 996.9286 997.5779 1016.2441 1054.4835 1063.5374 1076.1825 1080.6117 1094.0969 1114.9887 1165.0119 1170.9436 1185.2188 1186.7779 1203.8784 1246.7279 1296.5372 1305.8596 1319.9391 1347.1337 1354.8288 1361.9677 1375.3631 1410.1911 1421.9473 1426.8941 1443.4658 1459.8039 1479.1277 1506.6248 1560.5587 1573.4827 1585.0977 1589.5475 1598.2027 1609.7819 1647.8623 3123.3316 3125.8127 3126.4245 3133.3515 3146.3392 3148.6405 3154.9820 3157.4142 3167.2917 3167.3194 3187.1276 3195.1486 3259.6641 3534.0244
redmass: 6.6378 4.7429 4.8584 5.4954 4.6834 7.5362 9.1354 5.3093 5.8296 7.2324 5.8220 7.5848 5.4273 5.8527 6.1818 5.5765 6.2362 5.4304 3.7108 3.0657 6.1640 3.9469 9.2036 3.6531 4.5397 4.0229 3.0343 1.1976 5.7422 5.9099 6.5178 7.0788 6.7684 6.4525 2.2870 6.5131 3.6716 1.5006 6.8860 2.5476 1.5308 5.6095 1.5500 1.2563 1.3629 1.2197 5.8001 1.3695 1.3555 1.4178 1.3830 6.2487 1.3708 1.3131 6.2845 1.4640 3.1989 3.3120 2.3727 2.5065 1.6205 2.7335 1.9359 1.3801 1.4233 1.0514 1.1228 1.1367 1.8822 2.6088 1.3208 1.3247 2.3955 4.4884 3.0290 3.1710 8.0092 3.6907 2.8081 2.2232 2.7997 2.0427 2.4222 4.6063 6.4639 6.4780 6.2378 5.9329 5.7302 6.1413 1.8681 1.0893 1.0846 1.0905 1.0880 1.0927 1.0910 1.0961 1.0955 1.0998 1.0919 1.0994 1.0946 1.0802 1.0643
irintensity: 0.7860 0.8370 0.1996 1.1998 0.8232 0.3307 0.1988 1.5178 0.4255 1.0122 4.3937 7.2014 3.4313 1.4768 5.8386 0.6898 2.6810 6.2623 0.8031 0.7112 2.3103 2.3556 24.3440 17.9614 4.8031 4.4172 32.4915 137.3321 34.3085 8.1370 0.2085 3.7962 16.6607 1.3633 39.1155 24.4615 2.6822 68.4117 6.9091 33.4830 22.9338 17.4914 14.0323 1.4704 29.2398 113.0639 2.6810 1.5343 5.7236 0.3086 0.4461 7.0065 0.6566 0.6616 200.7058 18.1969 31.9457 26.8633 118.8133 18.4773 6.8903 5.6160 277.5442 4.8144 107.4075 0.1152 4.2365 1.2268 16.5632 11.4473 0.5098 1.0102 173.5847 14.3123 35.7277 11.2190 1.8965 10.5146 353.8185 51.9785 105.6301 59.1131 197.0393 163.7137 90.0933 97.8034 10.2241 49.6455 504.7434 169.9178 201.4876 12.5639 1.5628 20.9775 4.0679 15.7782 6.1810 25.5789 5.3883 20.3866 9.5372 11.0768 11.8151 147.8001 87.9673
temp: 298.150 k
press: 1.00000 atm
elementType: 16 8 8 7 7 6 6 6 6 6 6 6 6 6 6 6 6 6 6 6 6 6 6 1 1 1 1 1 1 1 1 1 1 1 1 1 1
symmnumber: 1
zpe: 727031.2 jmol-1
zpe.correction: 0.276912 hartree
zpe.thermalcorrener: 0.295526 hartree
zpe.thermalcorrenthalpy: 0.296470 hartree
zpe.thermalcorrgfe: 0.228033 hartree
zpe.sumelectzpe: -1350.758169 hartree
zpe.sumelectthermal: -1350.739554 hartree
zpe.sumelectthermalent: -1350.738610 hartree
zpe.sumelectthermalfe: -1350.807047 hartree
dipole: 3.3269 1.8789 0.8733
dipole: 3.9193
quadrupole: -112.2024 -130.1753 -141.6877
quadrupole: -5.8810 2.3347 -2.1347
quadrupole: 15.8194 -2.1535 -13.6659 -5.8810 2.3347 -2.1347
hfenergy: -1351.0350802 hartree
pointgroup: C01 [X(C18H14N2O2S1)]
dipole: -1.2938134 0.7718379 -0.3286493 debye
polarizability: 441.3568499|-1.6486698|240.5935746|33.0419511|13.3869704|135.1141373 unknown
InChI: InChI=1S/C18H14N2O2S/c21-18(22)16-7-4-12-19-17(16)20-13-8-10-15(11-9-13)23-14-5-2-1-3-6-14/h1-12,20-21H
charge 0 multiplicity 1
37 atoms
S  3.762141 -1.780124 0.828425
O  -6.32521 -0.936002 -1.061878
O  -4.280821 -2.021141 -1.072697
N  -2.151446 -0.66196 -0.132327
N  -2.507202 1.565052 0.632977
C  -0.760789 -0.813936 0.10118
C  2.006133 -1.340476 0.490576
C  -3.003346 0.398188 0.096021
C  -0.195582 -2.061745 -0.288376
C  0.081002 0.172104 0.688815
C  1.17556 -2.319546 -0.10434
C  1.44803 -0.103984 0.890348
C  -4.415126 0.267698 -0.236841
C  4.696133 -0.310451 0.214712
C  -5.265705 1.375877 0.007187
C  -4.745108 2.561195 0.554221
C  4.280704 0.445751 -0.906655
C  5.90788 0.001723 0.877179
C  -3.35862 2.597029 0.846284
C  -4.950817 -0.972107 -0.808458
C  5.078595 1.522059 -1.355857
C  6.707694 1.069181 0.409425
C  6.295391 1.835792 -0.705074
H  -2.63604 -1.482072 -0.543694
H  -0.832383 -2.828405 -0.746665
H  -0.353387 1.126704 0.986493
H  1.600776 -3.27561 -0.425926
H  2.08438 0.653145 1.360496
H  -6.326332 1.281744 -0.240824
H  -5.378147 3.429654 0.751547
H  3.345959 0.199639 -1.420799
H  6.217911 -0.578094 1.753428
H  -2.903446 3.498755 1.273533
H  4.751513 2.107703 -2.222453
H  7.645533 1.305493 0.924506
H  6.912668 2.667664 -1.061338
H  -6.599996 -1.811996 -1.444051
