program: Gaussian 09
title: 000006255
version: EM64L-G09RevD.01
frameworkgroup: C1[X(C12H22O11)]
method: RPBEPBE
basis: SDD
operation: Freq
keyword: #p
keyword: freq=noraman
keyword: PBEPBE/SDD
title: #p freq=noraman PBEPBE/SDD
converged: YES YES NO NO
title: Mulliken charges:
elementType: O O O O O O O O O O O C C C C C C C C C C C C H H H H H H H H H H H H H H H H H H H H H H
charge: -0.342514 -0.283396 -0.283895 -0.465449 -0.444689 -0.462975 -0.461268 -0.457985 -0.414875 -0.430687 -0.440370 0.033292 -0.120474 -0.081680 -0.112799 -0.221641 -0.147774 -0.099970 -0.139978 -0.027025 -0.109257 -0.354496 -0.373786 0.239411 0.223550 0.313475 0.233886 0.270598 0.236886 0.221457 0.245751 0.231918 0.243504 0.208709 0.231170 0.193288 0.255293 0.374658 0.355810 0.367391 0.368162 0.367354 0.358764 0.354446 0.348208
chargesum: 0.00000
title: Mulliken charges with hydrogens summed into heavy atoms:
elementType: O O O O O O O O O O O C C C C C C C C C C C C
charge: -0.342514 -0.283396 -0.283895 -0.090790 -0.088879 -0.095584 -0.093106 -0.090631 -0.056111 -0.076241 -0.092162 0.272703 0.103077 0.231794 0.121087 0.048958 0.089111 0.121487 0.091940 0.218726 0.134247 0.085383 0.074794
polarizability: 2.00465572e+02 -2.96613630e+00 1.59662068e+02 5.26550790e+00 1.05339472e+00 1.38070293e+02
1716.lowfreq: -11.1234 -8.6120 0.0001 0.0005 0.0009 13.2437 21.2590 29.1637 40.3441
frequency: 18.6442 28.3273 40.1427 51.3745 74.4016 83.0922 99.5789 103.1407 114.6283 125.6402 135.6294 155.5998 174.3035 196.1763 217.5580 223.3781 237.1965 252.3184 255.5353 277.1063 299.6325 306.1920 324.6316 339.9230 365.1307 375.9846 397.0408 403.0288 405.9735 409.6391 419.9489 433.1435 436.2622 442.3847 456.3621 457.3603 467.2461 500.8891 521.7150 522.4693 537.1936 560.4098 567.6959 589.3098 598.9955 639.8896 741.0445 791.5242 829.6658 851.5628 922.6929 942.0987 955.3551 959.0602 963.5556 973.5263 980.2139 996.8904 1008.3615 1013.6393 1019.3431 1026.9252 1031.1566 1043.9977 1050.5139 1054.3481 1060.8868 1070.4443 1090.8959 1102.3628 1110.8305 1117.1455 1131.9326 1167.2506 1181.6464 1190.2960 1193.3418 1210.1007 1218.8303 1230.4520 1234.7918 1250.5495 1257.9793 1264.3736 1274.5992 1287.4044 1295.5724 1302.1102 1306.0454 1316.5349 1328.2255 1329.7355 1335.4379 1338.4338 1341.1235 1352.8987 1363.3049 1366.7789 1379.0899 1380.4026 1381.3003 1384.9590 1389.2427 1395.9792 1399.8741 1462.7045 1465.1223 2951.9623 2957.5313 2960.4429 2965.3801 2969.6580 2974.1944 2975.9736 3013.5648 3021.1220 3027.6251 3064.9528 3091.9070 3101.3332 3114.1462 3507.9992 3538.7077 3542.6685 3542.9506 3543.3102 3546.7747 3549.0648 3559.8372
redmass: 6.6238 6.5078 6.6901 6.6126 6.7808 6.5104 4.9357 5.9357 4.9268 5.2469 5.4810 4.2990 3.2200 3.5883 4.3949 3.8077 4.8553 4.6303 3.6082 4.3025 4.1903 2.9338 4.1483 1.8139 4.3745 4.5309 2.9651 3.1269 1.5188 2.7345 1.2715 1.5497 1.8867 1.9953 1.2704 1.2396 2.0538 1.7982 2.4848 3.1476 3.5034 4.5690 3.6567 3.4136 3.5005 4.2956 5.7284 2.9041 3.1653 2.9490 5.4516 4.9884 5.3661 5.4189 4.4271 4.5199 5.1742 2.9941 5.1608 2.9205 5.1452 3.0578 4.1014 2.2534 2.5781 3.0078 2.9074 3.9957 3.2464 3.3914 2.0296 2.3731 2.5458 1.2310 1.3250 1.3037 1.3122 1.2133 1.2482 1.2335 1.2885 1.2036 1.2183 1.3694 1.2414 1.2489 1.1964 1.2328 1.2825 1.2637 1.1998 1.3402 1.3195 1.2488 1.2891 1.3650 1.4294 1.4335 1.3014 1.2927 1.2775 1.3200 1.4647 1.4635 1.7811 1.0817 1.0816 1.0817 1.0811 1.0750 1.0829 1.0701 1.0844 1.0794 1.0850 1.0866 1.0838 1.0859 1.0894 1.0943 1.0946 1.0647 1.0649 1.0653 1.0654 1.0655 1.0657 1.0655 1.0659
irintensity: 0.7028 1.3063 0.0766 0.2359 1.2359 1.4619 7.7063 4.3040 1.5643 0.4627 1.2158 0.6976 1.0004 1.9627 7.1065 12.8846 18.4758 1.8989 2.5351 2.6747 5.0369 63.7368 26.3104 39.1882 16.0795 11.7979 14.3362 25.8507 146.7827 30.4227 50.3151 13.8514 170.2748 80.2810 148.9683 263.8307 97.5509 98.8216 27.7937 41.2787 62.7501 17.8190 38.1209 27.4498 6.1272 10.3241 32.6344 32.3036 27.8068 62.6810 215.2626 84.3040 103.9524 67.3748 155.8227 65.8889 158.6010 78.9253 5.1536 27.0750 153.3448 39.1359 93.1917 14.8413 69.6057 166.9507 91.8651 9.1684 16.7127 22.9198 14.6255 12.7686 20.2012 27.7463 16.3763 14.3475 19.4588 5.3818 10.3783 64.3740 48.2265 16.7081 1.7825 1.9657 11.6461 44.6301 13.4798 31.5090 26.7860 9.7483 8.1882 9.0248 11.9092 4.7007 12.5067 10.3033 8.9325 0.4921 55.3252 9.6580 12.6851 15.5326 3.1894 8.0300 11.0433 6.3757 6.0440 5.2367 5.7396 26.6803 19.7782 42.8210 59.4628 52.8823 15.3396 57.5519 36.1451 15.4170 11.6050 19.1567 8.4438 27.6156 23.2190 5.7108 12.9440 22.5472 17.4077 24.2467 22.1776
temp: 298.150 k
press: 1.00000 atm
elementType: 8 8 8 8 8 8 8 8 8 8 8 6 6 6 6 6 6 6 6 6 6 6 6 1 1 1 1 1 1 1 1 1 1 1 1 1 1 1 1 1 1 1 1 1 1
symmnumber: 1
zpe: 936555.2 jmol-1
zpe.correction: 0.356715 hartree
zpe.thermalcorrener: 0.381394 hartree
zpe.thermalcorrenthalpy: 0.382338 hartree
zpe.thermalcorrgfe: 0.302414 hartree
zpe.sumelectzpe: -1295.998444 hartree
zpe.sumelectthermal: -1295.973765 hartree
zpe.sumelectthermalent: -1295.972821 hartree
zpe.sumelectthermalfe: -1296.052745 hartree
dipole: 3.6521 -2.9372 1.3199
dipole: 4.8690
quadrupole: -128.9477 -154.8562 -138.9479
quadrupole: 3.8847 9.4093 3.1213
quadrupole: 11.9696 -13.9389 1.9694 3.8847 9.4093 3.1213
hfenergy: -1296.3551592 hartree
pointgroup: C01 [X(C12H22O11)]
dipole: 1.4005478 -1.1573987 0.6069987 debye
polarizability: 199.9403818|-3.3713765|159.7973355|7.4753067|0.1116217|138.4602165 unknown
InChI: InChI=1S/C12H22O11/c13-1-3-5(15)6(16)9(19)12(22-3)23-10-4(2-14)21-11(20)8(18)7(10)17/h3-20H,1-2H2
charge 0 multiplicity 1
45 atoms
O  -0.189101 -0.6714 -0.424364
O  -1.672981 -0.036821 1.398295
O  3.011307 1.262528 -0.516126
O  1.546078 -2.096525 1.551187
O  -1.744341 -2.811841 -1.15473
O  -4.302809 -1.4202 -1.590641
O  -4.405538 1.327784 -0.759267
O  4.315714 -1.929187 0.951399
O  5.250059 0.761553 0.018319
O  1.492116 2.828137 -2.277064
O  -1.676407 2.596155 2.342775
C  1.08396 -0.167725 0.126067
C  2.066344 -1.313761 0.428637
C  -1.164605 -1.130106 0.593317
C  1.67957 0.760115 -0.958736
C  -2.282614 -1.816352 -0.218853
C  -3.132481 -0.781571 -0.980443
C  -3.665755 0.297274 -0.029797
C  3.457248 -0.755326 0.776901
C  -2.47888 0.988082 0.659079
C  3.983539 0.176801 -0.332911
C  0.85618 2.022319 -1.238283
C  -2.870929 2.016147 1.720193
H  0.882336 0.40367 1.054454
H  2.167671 -1.955414 -0.474854
H  -0.665534 -1.806305 1.304122
H  1.813589 0.190873 -1.90385
H  -2.930552 -2.383894 0.470808
H  -2.507772 -0.299393 -1.76365
H  -4.317913 -0.191774 0.727138
H  -1.834157 1.466066 -0.102515
H  3.390058 -0.167345 1.719845
H  4.163254 -0.375217 -1.276419
H  0.721141 2.597479 -0.297165
H  -0.130683 1.741414 -1.636172
H  -3.527583 1.540469 2.479068
H  -3.409735 2.849324 1.245208
H  2.24028 -2.762743 1.795164
H  -0.920941 -2.412508 -1.545348
H  -3.984037 -2.206616 -2.104834
H  -5.044877 0.859988 -1.357237
H  5.245531 -1.624891 1.111799
H  5.099951 1.453867 0.714575
H  2.426725 2.99823 -1.989433
H  -1.158226 1.840442 2.723841
