program: Orca
programVersion: 5.0.2
elementType: S O O N N C C C C C C C C C C C C C C C C C C H H H H H H H H H H H H H H H H H H H H H H
charge: 0
multiplicity: 1
keywords: wb97x-d3
keywords: def2-TZVPP
keywords: def2/J RIJCOSX
keywords: DEFGRID2
keywords: scfconv7
keywords: smallprint printgap noloewdin
keywords: NOSOSCF
formula: C18H22N2O2S
InChI: InChI=1/C18H22N2O2S/c1-18(2,3)13-8-6-9-14(12-13)22-17(23)20(4)15-10-7-11-16(19-15)21-5/h6-12H,1-5H3
45 atoms
S  2.567816 -1.330487 -0.199904
O  0.351859 -0.044246 0.462998
O  0.511319 5.449582 0.543896
N  1.826363 1.178807 -0.634305
N  1.114227 3.314151 -0.039916
C  -2.566301 -3.920934 -0.418376
C  -1.644101 -3.108234 0.483794
C  -2.735815 -3.283749 -1.796814
C  -3.949292 -4.026709 0.235729
C  -1.980118 -5.326156 -0.601774
C  -1.013653 -1.945658 0.05095
C  -1.407698 -3.524471 1.797477
C  -0.191868 -1.236854 0.911338
C  -0.586599 -2.800925 2.646978
C  0.034474 -1.637768 2.211339
C  1.550919 -0.032658 -0.133547
C  0.839216 2.201578 -0.707868
C  3.142703 1.460969 -1.187168
C  -0.293928 2.028264 -1.475166
C  -1.200794 3.083996 -1.520166
C  0.256638 4.31054 -0.106004
C  -0.937927 4.246391 -0.831271
C  1.715619 5.554092 1.291386
H  -3.408745 -3.894116 -2.401289
H  -3.169895 -2.283738 -1.736679
H  -1.790462 -3.209882 -2.338055
H  -4.395129 -3.040614 0.379189
H  -4.62373 -4.607861 -0.396483
H  -3.90808 -4.518658 1.208465
H  -2.624306 -5.922738 -1.251559
H  -0.9903 -5.285479 -1.060925
H  -1.886844 -5.858543 0.346123
H  -1.154218 -1.570393 -0.954147
H  -1.876637 -4.426022 2.17141
H  -0.426024 -3.1446 3.660339
H  0.675977 -1.063046 2.866197
H  3.17442 2.499595 -1.500237
H  3.341832 0.830055 -2.052195
H  3.92117 1.293656 -0.445311
H  -0.46735 1.113541 -2.024237
H  -2.106251 2.993747 -2.105206
H  -1.618142 5.08677 -0.852234
H  1.705464 6.548318 1.733223
H  2.598025 5.45775 0.657132
H  1.767755 4.812051 2.090005
elementType: S O N C H
totalener: -1357.40619243 hartree
nucrepener: 2050.92357147 hartree
electener: -3408.32976390 hartree
oneelecener: -5929.70983252 hartree
twoeener: 2521.38006861 hartree
cpcmener: -0.02755444 hartree
kineticenergy: 1352.47415110 hartree
xcener: -113.276168995741 hartree
chargesum: 0.0000000
charge: -0.434479 -0.283030 -0.319484 -0.046183 -0.405075 0.331943 -0.069662 -0.363137 -0.327088 -0.325455 -0.186428 -0.205334 0.231969 -0.170999 -0.190902 0.291710 0.211317 -0.148983 -0.231116 -0.088004 0.387841 -0.205700 -0.114679 0.102484 0.103933 0.101171 0.103282 0.097651 0.097494 0.097569 0.101647 0.097770 0.144755 0.144029 0.158859 0.150842 0.106872 0.111282 0.116002 0.163921 0.164275 0.151290 0.129584 0.108698 0.107546
qa: -0.4345 -0.2830 -0.3195 -0.0462 -0.4051 0.3319 -0.0697 -0.3631 -0.3271 -0.3255 -0.1864 -0.2053 0.2320 -0.1710 -0.1909 0.2917 0.2113 -0.1490 -0.2311 -0.0880 0.3878 -0.2057 -0.1147 0.1025 0.1039 0.1012 0.1033 0.0977 0.0975 0.0976 0.1016 0.0978 0.1448 0.1440 0.1589 0.1508 0.1069 0.1113 0.1160 0.1639 0.1643 0.1513 0.1296 0.1087 0.1075
va: 1.9732 2.1166 2.0836 3.2089 2.9847 3.6013 3.6905 3.9306 3.9180 3.9192 4.0384 3.9550 3.7059 3.9510 4.0423 4.2181 3.9833 3.8628 3.9264 3.9276 3.9659 3.9038 3.8590 1.0071 1.0005 1.0005 1.0028 1.0035 1.0045 1.0034 1.0039 1.0041 1.0011 1.0024 0.9905 1.0003 1.0090 1.0049 1.0003 0.9979 0.9890 1.0037 0.9936 0.9953 0.9968
dispcorr: -0.021439879 hartree
energy: -1357.427632306561
dipole: -15.50101 14.11179 -1.38923 -16.47462 17.67433 1.19971 -4.14413 3.50963 -0.63450
magnitude: 1.94212 au
magnitude: 4.93649 debye
