program: Orca
programVersion: 5.0.2
elementType: S O O N N C C C C C C C C C C C C C C C C C C H H H H H H H H H H H H H H H H H H H H H H
charge: 0
multiplicity: 1
keywords: wb97x-d3
keywords: def2-TZVPP
keywords: def2/J RIJCOSX
keywords: DEFGRID2
keywords: scfconv7
keywords: smallprint printgap noloewdin
keywords: NOSOSCF
formula: C18H22N2O2S
InChI: InChI=1/C18H22N2O2S/c1-18(2,3)13-8-6-9-14(12-13)22-17(23)20(4)15-10-7-11-16(19-15)21-5/h6-12H,1-5H3
45 atoms
S  2.525555 -1.243604 0.536541
O  0.200051 0.015134 0.53446
O  0.4615 5.515318 -0.049141
N  1.84299 1.127126 -0.440404
N  1.092723 3.318339 -0.246662
C  -2.196159 -4.146835 -0.436366
C  -1.619215 -3.164016 0.576894
C  -1.0731 -4.670067 -1.339414
C  -3.242014 -3.423865 -1.294046
C  -2.867787 -5.341084 0.238001
C  -0.929646 -2.037937 0.122675
C  -1.757604 -3.326427 1.953565
C  -0.40913 -1.128798 1.021745
C  -1.233249 -2.397978 2.845535
C  -0.547667 -1.284854 2.388772
C  1.493101 -0.004785 0.186112
C  0.889028 2.124036 -0.7865
C  3.239451 1.382299 -0.761913
C  -0.13458 1.847705 -1.668711
C  -1.005434 2.888345 -1.979985
C  0.271776 4.297115 -0.564289
C  -0.81476 4.134823 -1.428572
C  1.592699 5.733355 0.782528
H  -1.474301 -5.375812 -2.069473
H  -0.584688 -3.869286 -1.896072
H  -0.30779 -5.189543 -0.759894
H  -3.670764 -4.109489 -2.027943
H  -4.059027 -3.039547 -0.680669
H  -2.811355 -2.584129 -1.841622
H  -3.256916 -6.019249 -0.522925
H  -2.170643 -5.910017 0.855907
H  -3.708905 -5.041293 0.865473
H  -0.797615 -1.858264 -0.937797
H  -2.284124 -4.181423 2.353795
H  -1.359806 -2.548327 3.909582
H  -0.135315 -0.556109 3.074092
H  3.640713 0.576826 -1.373658
H  3.843581 1.471373 0.139548
H  3.307029 2.308886 -1.323432
H  -0.251059 0.867543 -2.107886
H  -1.824537 2.719436 -2.665482
H  -1.467751 4.965395 -1.658286
H  1.545874 5.143741 1.697981
H  1.571967 6.78873 1.040059
H  2.527509 5.513789 0.266542
elementType: S O N C H
totalener: -1357.40639026 hartree
nucrepener: 2052.57470034 hartree
electener: -3409.98109060 hartree
oneelecener: -5932.96124356 hartree
twoeener: 2522.98015296 hartree
cpcmener: -0.02778669 hartree
kineticenergy: 1352.48936289 hartree
xcener: -113.279528196607 hartree
chargesum: 0.0000000
charge: -0.434577 -0.285819 -0.320281 -0.042032 -0.405802 0.330760 -0.050915 -0.326779 -0.327717 -0.356708 -0.199960 -0.190993 0.206373 -0.138945 -0.219212 0.291508 0.215331 -0.155874 -0.229349 -0.091346 0.387469 -0.205218 -0.113930 0.097900 0.095475 0.102158 0.098333 0.103103 0.098091 0.101220 0.103606 0.100489 0.143382 0.147049 0.158315 0.153120 0.109184 0.119613 0.108662 0.163897 0.164034 0.151291 0.107751 0.130001 0.107342
qa: -0.4346 -0.2858 -0.3203 -0.0420 -0.4058 0.3308 -0.0509 -0.3268 -0.3277 -0.3567 -0.2000 -0.1910 0.2064 -0.1389 -0.2192 0.2915 0.2153 -0.1559 -0.2293 -0.0913 0.3875 -0.2052 -0.1139 0.0979 0.0955 0.1022 0.0983 0.1031 0.0981 0.1012 0.1036 0.1005 0.1434 0.1470 0.1583 0.1531 0.1092 0.1196 0.1087 0.1639 0.1640 0.1513 0.1078 0.1300 0.1073
va: 1.9738 2.1119 2.0824 3.2151 2.9873 3.6214 3.6754 3.9166 3.9176 3.9256 4.1256 3.8827 3.6991 3.9316 4.0501 4.2186 3.9761 3.8667 3.9200 3.9290 3.9684 3.9020 3.8593 1.0041 1.0046 1.0040 1.0034 1.0038 1.0034 1.0067 1.0000 1.0005 1.0036 0.9995 0.9909 0.9991 1.0084 0.9978 1.0077 0.9980 0.9891 1.0037 0.9963 0.9936 0.9962
dispcorr: -0.021500329 hartree
energy: -1357.427890587965
dipole: -12.58833 11.37383 -1.21451 -17.83209 18.91880 1.08671 -5.81832 4.66263 -1.15568
magnitude: 1.99789 au
magnitude: 5.07824 debye
