program: Orca
programVersion: 5.0.2
elementType: S O O N N C C C C C C C C C C C C C C C C C C H H H H H H H H H H H H H H H H H H H H H H
charge: 0
multiplicity: 1
keywords: wb97x-d3
keywords: def2-TZVPP
keywords: def2/J RIJCOSX
keywords: DEFGRID2
keywords: scfconv7
keywords: smallprint printgap noloewdin
keywords: NOSOSCF
formula: C18H22N2O2S
InChI: InChI=1/C18H22N2O2S/c1-18(2,3)13-8-6-9-14(12-13)22-17(23)20(4)15-10-7-11-16(19-15)21-5/h6-12H,1-5H3
45 atoms
S  2.678268 -1.553956 0.881654
O  1.108773 -0.426758 -0.91994
O  -1.486841 3.2584 -0.43071
N  2.502843 0.970596 0.076382
N  0.51076 2.161763 -0.195097
C  -2.610404 -2.380303 1.620328
C  -1.725285 -2.36379 0.378753
C  -3.244388 -0.997717 1.816691
C  -1.750144 -2.725147 2.841769
C  -3.732007 -3.41096 1.513216
C  -0.685628 -1.437586 0.299847
C  -1.903714 -3.235302 -0.694477
C  0.139607 -1.403518 -0.809255
C  -1.072263 -3.182895 -1.805883
C  -0.034364 -2.266974 -1.875254
C  2.062595 -0.293171 0.014278
C  1.787133 2.036501 -0.535214
C  3.695076 1.286456 0.85086
C  2.435265 2.898694 -1.394595
C  1.690809 3.951597 -1.922914
C  -0.188978 3.137824 -0.728838
C  0.358632 4.083553 -1.602785
C  -2.092324 2.245375 0.364864
H  -3.848464 -0.711246 0.95376
H  -3.897649 -1.004755 2.691682
H  -2.497305 -0.218868 1.976709
H  -1.296644 -3.712752 2.739211
H  -0.946283 -2.003214 2.993755
H  -2.361181 -2.732006 3.746795
H  -4.338584 -3.387346 2.420007
H  -4.396374 -3.208496 0.671259
H  -3.349331 -4.427416 1.40566
H  -0.519469 -0.731882 1.105027
H  -2.699455 -3.966732 -0.680714
H  -1.23425 -3.867761 -2.627725
H  0.616947 -2.219828 -2.738053
H  3.871961 2.356183 0.803136
H  4.566213 0.7653 0.4585
H  3.558532 1.003861 1.893269
H  3.476357 2.763366 -1.651536
H  2.158422 4.655079 -2.598406
H  -0.246859 4.881585 -2.009441
H  -2.017236 1.265099 -0.107484
H  -3.141005 2.520173 0.446816
H  -1.658603 2.196722 1.363893
elementType: S O N C H
totalener: -1357.40490045 hartree
nucrepener: 2126.75165700 hartree
electener: -3484.15655746 hartree
oneelecener: -6081.52417968 hartree
twoeener: 2597.36762223 hartree
cpcmener: -0.02783129 hartree
kineticenergy: 1352.48275966 hartree
xcener: -113.279900370652 hartree
chargesum: -0.0000000
charge: -0.423605 -0.288073 -0.323995 -0.045446 -0.393206 0.358641 -0.007181 -0.351381 -0.328351 -0.357735 -0.248082 -0.208549 0.237302 -0.128142 -0.250513 0.278290 0.204302 -0.150986 -0.221428 -0.085997 0.390235 -0.217761 -0.119565 0.107175 0.104718 0.088092 0.103016 0.092324 0.099405 0.101080 0.103365 0.100391 0.139788 0.146382 0.157916 0.150948 0.114751 0.119018 0.109998 0.165387 0.165553 0.152186 0.111875 0.135338 0.112516
qa: -0.4236 -0.2881 -0.3240 -0.0454 -0.3932 0.3586 -0.0072 -0.3514 -0.3284 -0.3577 -0.2481 -0.2085 0.2373 -0.1281 -0.2505 0.2783 0.2043 -0.1510 -0.2214 -0.0860 0.3902 -0.2178 -0.1196 0.1072 0.1047 0.0881 0.1030 0.0923 0.0994 0.1011 0.1034 0.1004 0.1398 0.1464 0.1579 0.1509 0.1148 0.1190 0.1100 0.1654 0.1656 0.1522 0.1119 0.1353 0.1125
va: 1.9913 2.0870 2.0852 3.2420 2.9993 3.5842 3.6427 3.9272 3.9204 3.9277 4.0340 3.8998 3.6856 3.9264 4.0624 4.2483 3.9905 3.8559 3.9054 3.9216 3.9637 3.9075 3.8652 1.0005 1.0074 1.0029 1.0037 1.0056 1.0042 1.0069 1.0003 1.0004 1.0124 0.9995 0.9907 1.0026 1.0008 0.9992 1.0074 0.9946 0.9879 1.0036 0.9877 0.9944 0.9940
dispcorr: -0.023970512 hartree
energy: -1357.428870964181
dipole: -20.21449 19.72481 -0.48968 -7.87361 9.79565 1.92204 12.49577 -13.02806 -0.53229
magnitude: 2.05362 au
magnitude: 5.21990 debye
