program: Orca
programVersion: 5.0.2
elementType: S O O N N C C C C C C C C C C C C C C C C C C H H H H H H H H H H H H H H H H H H H H H H
charge: 0
multiplicity: 1
keywords: wb97x-d3
keywords: def2-TZVPP
keywords: def2/J RIJCOSX
keywords: DEFGRID2
keywords: scfconv7
keywords: smallprint printgap noloewdin
keywords: NOSOSCF
formula: C18H22N2O2S
InChI: InChI=1/C18H22N2O2S/c1-18(2,3)13-8-6-9-14(12-13)22-17(23)20(4)15-10-7-11-16(19-15)21-5/h6-12H,1-5H3
45 atoms
S  2.234869 -1.02456 1.336434
O  0.367682 -0.149694 -0.320149
O  -0.163098 5.422636 -0.476238
N  1.900063 1.354612 0.2135
N  0.822006 3.373497 -0.179423
C  -2.592612 -3.670171 1.492547
C  -1.611792 -3.132623 0.456449
C  -3.904466 -4.060113 0.801529
C  -2.908496 -2.644961 2.579922
C  -1.980828 -4.908303 2.15915
C  -1.041552 -1.867307 0.554155
C  -1.244342 -3.930719 -0.63161
C  -0.137379 -1.437045 -0.403092
C  -0.34484 -3.482329 -1.584073
C  0.225757 -2.220612 -1.478123
C  1.486567 0.089365 0.375177
C  1.285883 2.248321 -0.70717
C  3.001986 1.86354 1.018258
C  1.247835 1.966311 -2.057475
C  0.670423 2.920487 -2.891067
C  0.296312 4.274372 -0.981715
C  0.184008 4.095445 -2.363656
C  -0.054777 5.639307 0.924375
H  -4.618392 -4.439309 1.535517
H  -4.361412 -3.201562 0.306005
H  -3.761892 -4.840687 0.053271
H  -3.36383 -1.739879 2.173496
H  -3.616078 -3.073178 3.29143
H  -2.020087 -2.353673 3.143267
H  -2.666938 -5.31595 2.904608
H  -1.772575 -5.699598 1.437778
H  -1.045591 -4.66374 2.666347
H  -1.28598 -1.201867 1.370859
H  -1.666991 -4.921382 -0.742486
H  -0.081448 -4.119819 -2.417729
H  0.930922 -1.858183 -2.215098
H  2.750877 1.86097 2.077489
H  3.220802 2.881071 0.711305
H  3.892861 1.257321 0.868742
H  1.662092 1.052115 -2.457331
H  0.618715 2.743525 -3.956929
H  -0.259436 4.859099 -2.987428
H  -0.603082 4.890643 1.496729
H  -0.493854 6.616922 1.107331
H  0.984436 5.64955 1.255024
elementType: S O N C H
totalener: -1357.40614807 hartree
nucrepener: 2044.88604865 hartree
electener: -3402.29219672 hartree
oneelecener: -5917.76071870 hartree
twoeener: 2515.46852198 hartree
cpcmener: -0.02680470 hartree
kineticenergy: 1352.48396062 hartree
xcener: -113.279043906440 hartree
chargesum: 0.0000000
charge: -0.433965 -0.285414 -0.320391 -0.044591 -0.409724 0.335345 -0.064509 -0.327730 -0.357221 -0.326126 -0.181807 -0.204689 0.231153 -0.178941 -0.191807 0.294153 0.223537 -0.154061 -0.232166 -0.090667 0.390189 -0.210741 -0.113731 0.097193 0.102807 0.097863 0.104337 0.101451 0.099489 0.097598 0.097961 0.101370 0.136802 0.144286 0.159089 0.154525 0.119430 0.106805 0.109391 0.162798 0.163895 0.151440 0.107110 0.129884 0.108381
qa: -0.4340 -0.2854 -0.3204 -0.0446 -0.4097 0.3353 -0.0645 -0.3277 -0.3572 -0.3261 -0.1818 -0.2047 0.2312 -0.1789 -0.1918 0.2942 0.2235 -0.1541 -0.2322 -0.0907 0.3902 -0.2107 -0.1137 0.0972 0.1028 0.0979 0.1043 0.1015 0.0995 0.0976 0.0980 0.1014 0.1368 0.1443 0.1591 0.1545 0.1194 0.1068 0.1094 0.1628 0.1639 0.1514 0.1071 0.1299 0.1084
va: 1.9740 2.1149 2.0830 3.2248 2.9826 3.6004 3.6955 3.9185 3.9274 3.9196 4.0465 3.9586 3.7324 3.9463 4.0215 4.2119 3.9675 3.8645 3.9241 3.9273 3.9657 3.9048 3.8586 1.0035 1.0029 1.0045 1.0005 1.0066 1.0016 1.0039 1.0040 1.0042 1.0120 1.0027 0.9919 0.9969 0.9986 1.0090 1.0081 0.9987 0.9890 1.0037 0.9972 0.9937 0.9951
dispcorr: -0.021323787 hartree
energy: -1357.427471861686
dipole: -16.90588 16.28989 -0.61599 -14.69484 15.74753 1.05270 10.26405 -11.43099 -1.16694
magnitude: 1.68801 au
magnitude: 4.29057 debye
