program: Orca
programVersion: 5.0.2
elementType: S O O N N C C C C C C C C C C C C C C C C C C H H H H H H H H H H H H H H H H H H H H H H
charge: 0
multiplicity: 1
keywords: wb97x-d3
keywords: def2-TZVPP
keywords: def2/J RIJCOSX
keywords: DEFGRID2
keywords: scfconv7
keywords: smallprint printgap noloewdin
keywords: NOSOSCF
formula: C18H22N2O2S
InChI: InChI=1/C18H22N2O2S/c1-18(2,3)13-8-6-9-14(12-13)22-17(23)20(4)15-10-7-11-16(19-15)21-5/h6-12H,1-5H3
45 atoms
S  2.681082 -1.305269 -0.222552
O  0.388961 -0.118709 0.356459
O  0.563191 5.511041 0.273605
N  1.872381 1.185415 -0.636641
N  1.150125 3.343036 -0.172242
C  -2.778601 -3.8437 -0.176406
C  -1.69393 -3.105274 0.60057
C  -4.032928 -3.978516 0.695522
C  -2.261441 -5.239446 -0.546087
C  -3.167287 -3.115049 -1.461943
C  -1.089817 -1.947839 0.116166
C  -1.264456 -3.589965 1.837878
C  -0.109369 -1.307347 0.854907
C  -0.284337 -2.935408 2.567694
C  0.30618 -1.77662 2.084954
C  1.615515 -0.049281 -0.171759
C  0.868949 2.184847 -0.752896
C  3.218785 1.520762 -1.075231
C  -0.280562 1.960483 -1.485611
C  -1.189724 3.009519 -1.582494
C  0.291206 4.333117 -0.288904
C  -0.91742 4.218734 -0.982632
C  1.767454 5.645927 1.012246
H  -4.422297 -3.001281 0.987647
H  -4.820851 -4.498574 0.146303
H  -3.844812 -4.547304 1.607095
H  -2.01573 -5.832145 0.336512
H  -3.017692 -5.790136 -1.110014
H  -1.364625 -5.178707 -1.165632
H  -2.330958 -3.027292 -2.158016
H  -3.955153 -3.669214 -1.975012
H  -3.551974 -2.112024 -1.266706
H  -1.374873 -1.523654 -0.837236
H  -1.701051 -4.491458 2.249586
H  0.024835 -3.331888 3.526271
H  1.066022 -1.256777 2.653032
H  3.942939 1.32641 -0.286374
H  3.252942 2.576056 -1.327503
H  3.495974 0.940814 -1.954682
H  -0.460698 1.01557 -1.977878
H  -2.106064 2.877884 -2.142713
H  -1.598781 5.055985 -1.048242
H  1.762547 6.659316 1.406974
H  2.650003 5.514173 0.383735
H  1.818214 4.941071 1.843583
elementType: S O N C H
totalener: -1357.41669781 hartree
nucrepener: 2045.68369440 hartree
electener: -3403.10039221 hartree
oneelecener: -5919.02888538 hartree
twoeener: 2515.92849317 hartree
cpcmener: -0.02266895 hartree
kineticenergy: 1352.49099771 hartree
xcener: -113.281128645827 hartree
chargesum: -0.0000000
charge: -0.419610 -0.278423 -0.309569 -0.047495 -0.409917 0.317151 -0.060712 -0.322933 -0.321106 -0.360567 -0.178261 -0.200190 0.210176 -0.170838 -0.166645 0.290663 0.231648 -0.152277 -0.235690 -0.088941 0.385097 -0.210407 -0.115361 0.102674 0.096424 0.096370 0.096340 0.096302 0.102618 0.100239 0.100863 0.104633 0.137797 0.138858 0.153873 0.146729 0.115210 0.105358 0.110865 0.158457 0.160307 0.148278 0.127927 0.107363 0.106718
qa: -0.4196 -0.2784 -0.3096 -0.0475 -0.4099 0.3172 -0.0607 -0.3229 -0.3211 -0.3606 -0.1783 -0.2002 0.2102 -0.1708 -0.1666 0.2907 0.2316 -0.1523 -0.2357 -0.0889 0.3851 -0.2104 -0.1154 0.1027 0.0964 0.0964 0.0963 0.0963 0.1026 0.1002 0.1009 0.1046 0.1378 0.1389 0.1539 0.1467 0.1152 0.1054 0.1109 0.1585 0.1603 0.1483 0.1279 0.1074 0.1067
va: 1.9918 2.1236 2.0952 3.2268 2.9802 3.6229 3.7016 3.9178 3.9209 3.9293 4.0324 3.9609 3.7691 3.9654 4.0221 4.2164 3.9679 3.8630 3.9262 3.9316 3.9762 3.9105 3.8641 1.0030 1.0039 1.0049 1.0044 1.0038 1.0039 1.0004 1.0078 1.0004 1.0045 1.0037 0.9925 1.0037 1.0021 1.0117 1.0040 0.9999 0.9902 1.0046 0.9938 0.9942 0.9975
dispcorr: -0.021270569 hartree
energy: -1357.437968378134
dipole: -16.99469 15.67067 -1.32402 -15.76878 16.87037 1.10159 -2.24596 1.81741 -0.42855
magnitude: 1.77488 au
magnitude: 4.51138 debye
