program: Orca
programVersion: 5.0.2
elementType: S O O N N C C C C C C C C C C C C C C C C C C H H H H H H H H H H H H H H H H H H H H H H
charge: 0
multiplicity: 1
keywords: wb97x-d3
keywords: def2-TZVPP
keywords: def2/J RIJCOSX
keywords: DEFGRID2
keywords: scfconv7
keywords: smallprint printgap noloewdin
keywords: NOSOSCF
formula: C18H22N2O2S
InChI: InChI=1/C18H22N2O2S/c1-18(2,3)13-8-6-9-14(12-13)22-17(23)20(4)15-10-7-11-16(19-15)21-5/h6-12H,1-5H3
45 atoms
S  2.674223 -1.769102 -0.212948
O  1.182706 0.153589 0.813945
O  -1.604068 2.992099 -1.358302
N  2.428782 0.786223 -0.894764
N  0.413313 1.939768 -1.13069
C  -2.617329 -2.972885 0.368143
C  -1.559538 -2.243525 1.189031
C  -2.489117 -2.687893 -1.127196
C  -4.008883 -2.524399 0.830096
C  -2.470999 -4.484001 0.584474
C  -0.630181 -1.388842 0.609374
C  -1.506802 -2.418805 2.57672
C  0.320359 -0.750507 1.394827
C  -0.559107 -1.768312 3.348031
C  0.376789 -0.924379 2.76143
C  2.064609 -0.240305 -0.112546
C  1.713094 2.014336 -0.877346
C  3.530432 0.629943 -1.831522
C  2.378651 3.19897 -0.639272
C  1.623983 4.370498 -0.670066
C  -0.291776 3.048909 -1.131015
C  0.270258 4.312885 -0.911878
C  -2.20641 1.713178 -1.505764
H  -3.252545 -3.245019 -1.67376
H  -2.632228 -1.630795 -1.36316
H  -1.518907 -2.9941 -1.524362
H  -4.14316 -1.44786 0.696242
H  -4.78535 -3.031332 0.250727
H  -4.185462 -2.753396 1.883505
H  -3.21663 -5.025484 -0.001887
H  -1.48522 -4.837262 0.274899
H  -2.611572 -4.767559 1.628696
H  -0.632521 -1.201926 -0.456806
H  -2.218272 -3.070561 3.068242
H  -0.540842 -1.920546 4.419839
H  1.125025 -0.414208 3.355133
H  3.660596 1.557916 -2.380441
H  3.318105 -0.166597 -2.543604
H  4.457759 0.394106 -1.31157
H  3.438734 3.215238 -0.426964
H  2.101507 5.324228 -0.487247
H  -0.343994 5.202832 -0.929839
H  -2.099698 1.111832 -0.601117
H  -1.794702 1.1614 -2.351967
H  -3.262763 1.902584 -1.684116
elementType: S O N C H
totalener: -1357.41619764 hartree
nucrepener: 2116.99014837 hartree
electener: -3474.40634601 hartree
oneelecener: -6061.95425394 hartree
twoeener: 2587.54790793 hartree
cpcmener: -0.02405038 hartree
kineticenergy: 1352.47917523 hartree
xcener: -113.277910877692 hartree
chargesum: 0.0000000
charge: -0.418046 -0.280311 -0.311762 -0.050949 -0.389301 0.315029 -0.022398 -0.342647 -0.323765 -0.324723 -0.212790 -0.215766 0.260923 -0.158627 -0.225200 0.275464 0.198370 -0.153635 -0.216096 -0.086618 0.382477 -0.211339 -0.108414 0.100987 0.091914 0.102299 0.100757 0.096799 0.097227 0.096065 0.102895 0.096587 0.136999 0.140657 0.153607 0.147706 0.112097 0.111097 0.118288 0.161999 0.161391 0.148400 0.103958 0.108122 0.130274
qa: -0.4180 -0.2803 -0.3118 -0.0509 -0.3893 0.3150 -0.0224 -0.3426 -0.3238 -0.3247 -0.2128 -0.2158 0.2609 -0.1586 -0.2252 0.2755 0.1984 -0.1536 -0.2161 -0.0866 0.3825 -0.2113 -0.1084 0.1010 0.0919 0.1023 0.1008 0.0968 0.0972 0.0961 0.1029 0.0966 0.1370 0.1407 0.1536 0.1477 0.1121 0.1111 0.1183 0.1620 0.1614 0.1484 0.1040 0.1081 0.1303
va: 1.9949 2.0986 2.1000 3.2265 2.9988 3.6338 3.6753 3.9273 3.9208 3.9163 3.9566 3.9747 3.7038 3.9514 4.0672 4.2462 3.9983 3.8603 3.9064 3.9265 3.9827 3.9035 3.8636 1.0082 1.0048 1.0020 1.0040 1.0037 1.0043 1.0039 1.0037 1.0049 1.0145 1.0030 0.9918 1.0030 1.0010 1.0071 0.9993 0.9963 0.9893 1.0048 0.9928 0.9970 0.9955
dispcorr: -0.023359650 hartree
energy: -1357.439557290395
dipole: -20.99048 20.41271 -0.57777 -14.09582 15.87127 1.77545 -2.80379 2.38625 -0.41753
magnitude: 1.91321 au
magnitude: 4.86299 debye
