program: Orca
programVersion: 5.0.2
elementType: S O O N N C C C C C C C C C C C C C C C C C C H H H H H H H H H H H H H H H H H H H H H H
charge: 0
multiplicity: 1
keywords: wb97x-d3
keywords: def2-TZVPP
keywords: def2/J RIJCOSX
keywords: DEFGRID2
keywords: scfconv7
keywords: smallprint printgap noloewdin
keywords: NOSOSCF
formula: C18H22N2O2S
InChI: InChI=1/C18H22N2O2S/c1-18(2,3)13-8-6-9-14(12-13)22-17(23)20(4)15-10-7-11-16(19-15)21-5/h6-12H,1-5H3
45 atoms
S  2.753132 -1.5115 0.851677
O  1.11983 -0.439612 -0.924739
O  -1.48739 3.233266 -0.269191
N  2.544227 0.987458 -0.023157
N  0.525285 2.149738 -0.176388
C  -2.633541 -2.41498 1.602303
C  -1.657327 -2.400474 0.430549
C  -2.407859 -1.246236 2.559736
C  -2.454982 -3.721754 2.384532
C  -4.068863 -2.328753 1.069609
C  -0.665803 -1.435326 0.30502
C  -1.742722 -3.379543 -0.56534
C  0.202881 -1.457989 -0.776997
C  -0.872262 -3.387082 -1.64125
C  0.120028 -2.420771 -1.759706
C  2.109204 -0.280777 -0.036719
C  1.777099 2.035908 -0.600486
C  3.75425 1.329559 0.708801
C  2.352806 2.892039 -1.516467
C  1.560088 3.928416 -2.005523
C  -0.22027 3.115109 -0.665763
C  0.254257 4.053903 -1.589646
C  -2.020328 2.234907 0.590205
H  -1.4125 -1.263479 3.008014
H  -2.54192 -0.278526 2.071049
H  -3.130039 -1.296512 3.376582
H  -1.441052 -3.81187 2.779397
H  -3.144366 -3.757248 3.231235
H  -2.650417 -4.600282 1.767804
H  -4.781783 -2.332964 1.89683
H  -4.226765 -1.410421 0.500651
H  -4.320294 -3.168588 0.420579
H  -0.556464 -0.648382 1.039195
H  -2.502279 -4.149081 -0.505453
H  -0.961123 -4.154689 -2.399056
H  0.805246 -2.418281 -2.597532
H  4.601911 0.747977 0.351155
H  3.627569 1.14207 1.774718
H  3.966239 2.384978 0.566254
H  3.373769 2.759656 -1.84623
H  1.968418 4.626043 -2.724682
H  -0.388558 4.841088 -1.959213
H  -1.48124 2.177993 1.536161
H  -2.016217 1.253226 0.113758
H  -3.049077 2.529019 0.785553
elementType: S O N C H
totalener: -1357.41605521 hartree
nucrepener: 2122.99376249 hartree
electener: -3480.40981770 hartree
oneelecener: -6073.89830953 hartree
twoeener: 2593.48849183 hartree
cpcmener: -0.02409764 hartree
kineticenergy: 1352.49646360 hartree
xcener: -113.281830418339 hartree
chargesum: -0.0000000
charge: -0.416416 -0.281885 -0.311846 -0.053809 -0.389058 0.314099 -0.020794 -0.348748 -0.325357 -0.322827 -0.201333 -0.216353 0.253700 -0.158146 -0.224335 0.272262 0.207553 -0.150605 -0.221576 -0.084999 0.385042 -0.216526 -0.114596 0.103581 0.091824 0.102126 0.103187 0.096054 0.096588 0.096528 0.101669 0.097209 0.134933 0.140293 0.153670 0.146830 0.116525 0.112434 0.110436 0.162099 0.161352 0.148888 0.109314 0.108509 0.132503
qa: -0.4164 -0.2819 -0.3118 -0.0538 -0.3891 0.3141 -0.0208 -0.3487 -0.3254 -0.3228 -0.2013 -0.2164 0.2537 -0.1581 -0.2243 0.2723 0.2076 -0.1506 -0.2216 -0.0850 0.3850 -0.2165 -0.1146 0.1036 0.0918 0.1021 0.1032 0.0961 0.0966 0.0965 0.1017 0.0972 0.1349 0.1403 0.1537 0.1468 0.1165 0.1124 0.1104 0.1621 0.1614 0.1489 0.1093 0.1085 0.1325
va: 1.9971 2.0994 2.1008 3.2336 3.0007 3.6310 3.6744 3.9258 3.9177 3.9192 3.9483 3.9763 3.7111 3.9516 4.0702 4.2523 3.9878 3.8591 3.9090 3.9277 3.9801 3.9056 3.8614 1.0007 1.0070 1.0091 1.0039 1.0039 1.0047 1.0043 1.0031 1.0048 1.0168 1.0028 0.9917 1.0032 1.0014 1.0052 1.0012 0.9962 0.9894 1.0049 0.9950 0.9899 0.9957
dispcorr: -0.023756326 hartree
energy: -1357.439811537766
dipole: -20.67169 20.08130 -0.59039 -8.21941 9.96980 1.75039 12.29073 -12.87177 -0.58104
magnitude: 1.93650 au
magnitude: 4.92220 debye
