program: Orca
programVersion: 5.0.2
elementType: S O O N N C C C C C C C C C C C C C C C C C C H H H H H H H H H H H H H H H H H H H H H H
charge: 0
multiplicity: 1
keywords: wb97x-d3
keywords: def2-TZVPP
keywords: def2/J RIJCOSX
keywords: DEFGRID2
keywords: scfconv7
keywords: smallprint printgap noloewdin
keywords: NOSOSCF
formula: C18H22N2O2S
InChI: InChI=1/C18H22N2O2S/c1-18(2,3)13-8-6-9-14(12-13)22-17(23)20(4)15-10-7-11-16(19-15)21-5/h6-12H,1-5H3
45 atoms
S  2.699848 -1.486919 0.930971
O  1.125885 -0.420217 -0.898874
O  -1.530241 3.208489 -0.602434
N  2.482395 1.021827 0.086821
N  0.475847 2.159093 -0.279974
C  -2.614408 -2.380211 1.671352
C  -1.692602 -2.327339 0.457036
C  -2.293896 -1.287497 2.690301
C  -2.457181 -3.743744 2.356165
C  -4.068639 -2.201601 1.219194
C  -0.663135 -1.400669 0.34982
C  -1.866593 -3.233634 -0.594686
C  0.162808 -1.395315 -0.766366
C  -1.043442 -3.208809 -1.70685
C  -0.008676 -2.285776 -1.805004
C  2.06893 -0.253551 0.037445
C  1.766747 2.059969 -0.567782
C  3.662461 1.368231 0.864034
C  2.427064 2.922511 -1.419223
C  1.678804 3.947142 -1.995186
C  -0.224862 3.111052 -0.854344
C  0.333501 4.054181 -1.725443
C  -2.142957 2.194901 0.182562
H  -2.98489 -1.356619 3.532049
H  -1.283445 -1.379082 3.093498
H  -2.399669 -0.285657 2.267873
H  -1.428972 -3.906714 2.685349
H  -3.100742 -3.805321 3.236594
H  -2.728826 -4.568426 1.695307
H  -4.378369 -2.967447 0.506792
H  -4.742416 -2.264175 2.076637
H  -4.221133 -1.228169 0.748073
H  -0.491878 -0.667062 1.126231
H  -2.658663 -3.97072 -0.550094
H  -1.203083 -3.917506 -2.50923
H  0.641114 -2.259398 -2.670275
H  4.553026 0.884052 0.4657
H  3.536177 1.064859 1.902271
H  3.80167 2.444723 0.834302
H  3.479275 2.802103 -1.63645
H  2.153255 4.64876 -2.668499
H  -0.27782 4.82935 -2.16705
H  -2.02295 1.207575 -0.266565
H  -3.201925 2.442395 0.212369
H  -1.753678 2.176493 1.201569
elementType: S O N C H
totalener: -1357.41565283 hartree
nucrepener: 2125.08962713 hartree
electener: -3482.50527996 hartree
oneelecener: -6078.08156351 hartree
twoeener: 2595.57628355 hartree
cpcmener: -0.02384035 hartree
kineticenergy: 1352.48940276 hartree
xcener: -113.280956612639 hartree
chargesum: 0.0000000
charge: -0.413082 -0.280871 -0.312278 -0.045263 -0.389700 0.318864 -0.015102 -0.346650 -0.324821 -0.322563 -0.220819 -0.221403 0.268624 -0.155972 -0.231832 0.272353 0.204909 -0.156779 -0.223386 -0.084671 0.384944 -0.216913 -0.110530 0.101884 0.101578 0.093061 0.103158 0.096080 0.097114 0.097045 0.096405 0.099804 0.134865 0.139998 0.153083 0.146935 0.120278 0.109957 0.113007 0.162226 0.161886 0.149245 0.108051 0.130358 0.106923
qa: -0.4131 -0.2809 -0.3123 -0.0453 -0.3897 0.3189 -0.0151 -0.3467 -0.3248 -0.3226 -0.2208 -0.2214 0.2686 -0.1560 -0.2318 0.2724 0.2049 -0.1568 -0.2234 -0.0847 0.3849 -0.2169 -0.1105 0.1019 0.1016 0.0931 0.1032 0.0961 0.0971 0.0970 0.0964 0.0998 0.1349 0.1400 0.1531 0.1469 0.1203 0.1100 0.1130 0.1622 0.1619 0.1492 0.1081 0.1304 0.1069
va: 2.0027 2.0925 2.0991 3.2330 3.0009 3.6291 3.6722 3.9285 3.9171 3.9205 3.9305 3.9812 3.6883 3.9516 4.0694 4.2515 3.9976 3.8609 3.9058 3.9243 3.9799 3.9082 3.8692 1.0083 1.0017 1.0061 1.0039 1.0039 1.0043 1.0051 1.0041 1.0042 1.0184 1.0028 0.9919 1.0039 0.9979 1.0086 1.0006 0.9954 0.9892 1.0047 0.9901 0.9955 0.9969
dispcorr: -0.023779431 hartree
energy: -1357.439432263228
dipole: -20.55453 20.01009 -0.54444 -8.26201 10.04270 1.78069 12.44019 -12.99955 -0.55936
magnitude: 1.94426 au
magnitude: 4.94191 debye
