program: Orca
programVersion: 5.0.2
elementType: S O O N N C C C C C C C C C C C C C C C C C C H H H H H H H H H H H H H H H H H H H H H H
charge: 0
multiplicity: 1
keywords: wb97x-d3
keywords: def2-TZVPP
keywords: def2/J RIJCOSX
keywords: DEFGRID2
keywords: scfconv7
keywords: smallprint printgap noloewdin
keywords: NOSOSCF
formula: C18H22N2O2S
InChI: InChI=1/C18H22N2O2S/c1-18(2,3)13-8-6-9-14(12-13)22-17(23)20(4)15-10-7-11-16(19-15)21-5/h6-12H,1-5H3
45 atoms
S  2.639393 -1.471045 0.96715
O  1.085597 -0.398701 -0.873327
O  -1.524211 3.193522 -0.894269
N  2.437664 1.042369 0.130668
N  0.456862 2.168153 -0.396126
C  -2.574979 -2.445254 1.75383
C  -1.71041 -2.330199 0.502042
C  -2.193136 -1.419746 2.819965
C  -2.398108 -3.848299 2.348899
C  -4.0470 -2.230737 1.384342
C  -0.681539 -1.402757 0.395506
C  -1.933813 -3.185033 -0.583014
C  0.108988 -1.359923 -0.745915
C  -1.152841 -3.115965 -1.723177
C  -0.109219 -2.202378 -1.815462
C  2.017488 -0.23203 0.07276
C  1.77062 2.090447 -0.556463
C  3.61265 1.370832 0.925527
C  2.499304 2.990571 -1.309403
C  1.797383 4.028635 -1.918123
C  -0.197708 3.128947 -1.007879
C  0.430167 4.111035 -1.783092
C  -2.189254 2.165982 -0.1722
H  -2.827715 -1.550072 3.698275
H  -1.158615 -1.531501 3.150466
H  -2.328069 -0.392731 2.473702
H  -1.357754 -4.035716 2.621921
H  -3.003198 -3.958236 3.251585
H  -2.705258 -4.631076 1.653611
H  -4.677225 -2.315625 2.272462
H  -4.209419 -1.239473 0.955977
H  -4.403559 -2.967144 0.662592
H  -0.48055 -0.703512 1.195865
H  -2.730584 -3.917226 -0.541567
H  -1.34865 -3.78615 -2.550207
H  0.512974 -2.147692 -2.699412
H  4.514423 0.93033 0.501648
H  3.491415 1.004623 1.943018
H  3.727194 2.449762 0.959743
H  3.5691 2.892247 -1.429556
H  2.328303 4.760825 -2.51203
H  -0.14378 4.895924 -2.256245
H  -1.882905 2.13714 0.874574
H  -2.025226 1.183561 -0.618527
H  -3.248974 2.405647 -0.224548
elementType: S O N C H
totalener: -1357.41491160 hartree
nucrepener: 2122.37659342 hartree
electener: -3479.79150501 hartree
oneelecener: -6072.68155575 hartree
twoeener: 2592.89005074 hartree
cpcmener: -0.02352864 hartree
kineticenergy: 1352.48831296 hartree
xcener: -113.281810993332 hartree
chargesum: 0.0000000
charge: -0.411873 -0.277563 -0.311747 -0.042703 -0.389700 0.326073 -0.019640 -0.349855 -0.324497 -0.324705 -0.221161 -0.225290 0.269400 -0.154623 -0.232536 0.274206 0.212660 -0.162376 -0.231919 -0.082959 0.387312 -0.224061 -0.108667 0.101255 0.099401 0.098761 0.102920 0.096269 0.096735 0.096498 0.100169 0.096594 0.135953 0.139860 0.153715 0.146903 0.123205 0.109471 0.113563 0.162008 0.161486 0.148699 0.104925 0.106781 0.131052
qa: -0.4119 -0.2776 -0.3117 -0.0427 -0.3897 0.3261 -0.0196 -0.3499 -0.3245 -0.3247 -0.2212 -0.2253 0.2694 -0.1546 -0.2325 0.2742 0.2127 -0.1624 -0.2319 -0.0830 0.3873 -0.2241 -0.1087 0.1013 0.0994 0.0988 0.1029 0.0963 0.0967 0.0965 0.1002 0.0966 0.1360 0.1399 0.1537 0.1469 0.1232 0.1095 0.1136 0.1620 0.1615 0.1487 0.1049 0.1068 0.1311
va: 2.0023 2.0913 2.0986 3.2400 3.0009 3.6212 3.6719 3.9312 3.9175 3.9216 3.9268 3.9834 3.6759 3.9533 4.0652 4.2459 4.0039 3.8607 3.9014 3.9192 3.9801 3.9121 3.8687 1.0079 1.0029 1.0025 1.0040 1.0040 1.0045 1.0038 1.0042 1.0050 1.0187 1.0031 0.9918 1.0043 0.9961 1.0110 1.0003 0.9941 0.9894 1.0049 0.9992 0.9910 0.9941
dispcorr: -0.023515603 hartree
energy: -1357.438427198168
dipole: -20.07580 19.61312 -0.46268 -8.84248 10.61053 1.76805 12.77898 -13.26043 -0.48145
magnitude: 1.88994 au
magnitude: 4.80384 debye
