program: Orca
programVersion: 5.0.2
elementType: S O O N N C C C C C C C C C C C C C C C C C C H H H H H H H H H H H H H H H H H H H H H H
charge: 0
multiplicity: 1
keywords: wb97x-d3
keywords: def2-TZVPP
keywords: def2/J RIJCOSX
keywords: DEFGRID2
keywords: scfconv7
keywords: smallprint printgap noloewdin
keywords: NOSOSCF
formula: C18H22N2O2S
InChI: InChI=1/C18H22N2O2S/c1-18(2,3)13-8-6-9-14(12-13)22-17(23)20(4)15-10-7-11-16(19-15)21-5/h6-12H,1-5H3
45 atoms
S  2.513966 -1.223086 0.502271
O  0.169876 -0.005337 0.438592
O  0.523517 5.555988 -0.047945
N  1.825742 1.156057 -0.452724
N  1.108575 3.352674 -0.257977
C  -2.206999 -4.198531 -0.428076
C  -1.628664 -3.19161 0.561384
C  -1.084735 -4.738615 -1.322292
C  -3.258501 -3.49812 -1.297712
C  -2.87268 -5.380088 0.274432
C  -0.947627 -2.072024 0.078793
C  -1.755172 -3.326211 1.941854
C  -0.424504 -1.14146 0.953784
C  -1.226869 -2.377803 2.810149
C  -0.551374 -1.271257 2.32513
C  1.473659 0.006404 0.143166
C  0.879313 2.160989 -0.791911
C  3.229561 1.433289 -0.715666
C  -0.158123 1.903324 -1.665798
C  -1.012484 2.960413 -1.96679
C  0.30309 4.347045 -0.563979
C  -0.796007 4.204129 -1.416741
C  1.65128 5.73502 0.796233
H  -1.482977 -5.464334 -2.034853
H  -0.600289 -3.950219 -1.900203
H  -0.313848 -5.240043 -0.733814
H  -3.690581 -4.200295 -2.014357
H  -4.073878 -3.100057 -0.690512
H  -2.833776 -2.670125 -1.867809
H  -3.264016 -6.076433 -0.469271
H  -2.172089 -5.935553 0.901076
H  -3.712638 -5.070549 0.899188
H  -0.823767 -1.915024 -0.98611
H  -2.274485 -4.174823 2.36476
H  -1.343337 -2.507274 3.878455
H  -0.13649 -0.526942 2.992479
H  3.6586 0.653467 -1.342122
H  3.801993 1.492762 0.209096
H  3.309461 2.381708 -1.238144
H  -0.295345 0.928259 -2.110631
H  -1.840874 2.806087 -2.645584
H  -1.437764 5.045748 -1.638822
H  1.579595 5.13668 1.706028
H  1.656717 6.788965 1.064457
H  2.585936 5.493766 0.28746
elementType: S O N C H
totalener: -1357.41791405 hartree
nucrepener: 2049.71723430 hartree
electener: -3407.13514835 hartree
oneelecener: -5927.14514950 hartree
twoeener: 2520.01000115 hartree
cpcmener: -0.02355222 hartree
kineticenergy: 1352.48922818 hartree
xcener: -113.279866366429 hartree
chargesum: 0.0000000
charge: -0.424058 -0.281622 -0.309569 -0.045137 -0.405094 0.322349 -0.046761 -0.322927 -0.324931 -0.355186 -0.193203 -0.186629 0.196754 -0.136676 -0.205619 0.288643 0.222319 -0.156809 -0.229962 -0.089494 0.383785 -0.207665 -0.114651 0.096211 0.094813 0.103143 0.097197 0.103103 0.096716 0.099781 0.103518 0.099963 0.136290 0.143676 0.154462 0.149909 0.109920 0.118855 0.105527 0.158438 0.160205 0.148523 0.107564 0.128198 0.106132
qa: -0.4241 -0.2816 -0.3096 -0.0451 -0.4051 0.3223 -0.0468 -0.3229 -0.3249 -0.3552 -0.1932 -0.1866 0.1968 -0.1367 -0.2056 0.2886 0.2223 -0.1568 -0.2300 -0.0895 0.3838 -0.2077 -0.1147 0.0962 0.0948 0.1031 0.0972 0.1031 0.0967 0.0998 0.1035 0.1000 0.1363 0.1437 0.1545 0.1499 0.1099 0.1189 0.1055 0.1584 0.1602 0.1485 0.1076 0.1282 0.1061
va: 1.9836 2.1167 2.0957 3.2208 2.9831 3.6352 3.6806 3.9176 3.9180 3.9255 4.1353 3.8885 3.7300 3.9400 4.0531 4.2181 3.9752 3.8696 3.9227 3.9299 3.9814 3.9060 3.8636 1.0040 1.0047 1.0041 1.0037 1.0040 1.0038 1.0073 1.0002 1.0007 1.0069 1.0005 0.9922 0.9995 1.0077 0.9989 1.0090 1.0003 0.9902 1.0046 0.9966 0.9938 0.9957
dispcorr: -0.021416158 hartree
energy: -1357.439330203445
dipole: -12.54193 11.38431 -1.15762 -18.15948 19.22387 1.06438 -5.27334 4.28759 -0.98575
magnitude: 1.85599 au
magnitude: 4.71756 debye
