program: Orca
programVersion: 5.0.2
elementType: S O O N N C C C C C C C C C C C C C C C C C C H H H H H H H H H H H H H H H H H H H H H H
charge: 0
multiplicity: 1
keywords: wb97x-d3
keywords: def2-TZVPP
keywords: def2/J RIJCOSX
keywords: DEFGRID2
keywords: scfconv7
keywords: smallprint printgap noloewdin
keywords: NOSOSCF
formula: C18H22N2O2S
InChI: InChI=1/C18H22N2O2S/c1-18(2,3)13-8-6-9-14(12-13)22-17(23)20(4)15-10-7-11-16(19-15)21-5/h6-12H,1-5H3
45 atoms
S  2.645447 -1.266279 1.099248
O  1.078403 -0.359299 -0.816286
O  -1.642616 3.12397 -1.093306
N  2.373261 1.183612 0.109167
N  0.365859 2.205381 -0.5109
C  -2.502503 -2.498514 1.845007
C  -1.621746 -2.39205 0.604338
C  -2.274634 -3.866949 2.500651
C  -3.975174 -2.36549 1.44059
C  -2.186599 -1.415295 2.875032
C  -0.650806 -1.407749 0.46833
C  -1.770379 -3.31164 -0.439682
C  0.159716 -1.372705 -0.658876
C  -0.970826 -3.251289 -1.56746
C  0.016988 -2.280487 -1.687183
C  1.995578 -0.10658 0.123889
C  1.683484 2.163687 -0.65023
C  3.528606 1.599113 0.890953
C  2.391161 3.040856 -1.449396
C  1.662235 4.01382 -2.129785
C  -0.313034 3.101417 -1.190034
C  0.291011 4.056501 -2.016227
C  -2.276697 2.101362 -0.338492
H  -2.888375 -3.965431 3.398726
H  -2.536821 -4.691136 1.835542
H  -1.231576 -3.997382 2.795935
H  -4.283933 -3.146518 0.744144
H  -4.619078 -2.440228 2.319711
H  -4.171112 -1.401176 0.967212
H  -2.366271 -0.41049 2.486953
H  -2.826836 -1.542376 3.749659
H  -1.152474 -1.463133 3.221951
H  -0.511346 -0.655677 1.233247
H  -2.522342 -4.088221 -0.375069
H  -1.108475 -3.972307 -2.36292
H  0.653489 -2.230953 -2.561271
H  3.588132 2.683146 0.886909
H  4.452809 1.189725 0.484265
H  3.423883 1.264177 1.920848
H  3.465506 2.972728 -1.549052
H  2.17529 4.726144 -2.762461
H  -0.304365 4.789104 -2.543767
H  -3.344608 2.292452 -0.417537
H  -1.986743 2.127598 0.712846
H  -2.064198 1.108425 -0.739701
elementType: S O N C H
totalener: -1357.41493344 hartree
nucrepener: 2119.87759707 hartree
electener: -3477.29253051 hartree
oneelecener: -6067.69702112 hartree
twoeener: 2590.40449061 hartree
cpcmener: -0.02345608 hartree
kineticenergy: 1352.49182518 hartree
xcener: -113.282420046851 hartree
chargesum: 0.0000000
charge: -0.412841 -0.275866 -0.312108 -0.044104 -0.388220 0.325165 -0.019912 -0.324821 -0.324544 -0.349484 -0.215435 -0.223123 0.264444 -0.156558 -0.230700 0.275688 0.211829 -0.165003 -0.232412 -0.081811 0.386569 -0.224580 -0.108118 0.096240 0.096668 0.103160 0.096930 0.096461 0.100274 0.098148 0.100939 0.099700 0.136170 0.140101 0.153186 0.146886 0.114128 0.124067 0.109088 0.161974 0.161680 0.148552 0.130745 0.104291 0.106558
qa: -0.4128 -0.2759 -0.3121 -0.0441 -0.3882 0.3252 -0.0199 -0.3248 -0.3245 -0.3495 -0.2154 -0.2231 0.2644 -0.1566 -0.2307 0.2757 0.2118 -0.1650 -0.2324 -0.0818 0.3866 -0.2246 -0.1081 0.0962 0.0967 0.1032 0.0969 0.0965 0.1003 0.0981 0.1009 0.0997 0.1362 0.1401 0.1532 0.1469 0.1141 0.1241 0.1091 0.1620 0.1617 0.1486 0.1307 0.1043 0.1066
va: 2.0016 2.0934 2.0977 3.2358 2.9987 3.6219 3.6713 3.9172 3.9217 3.9311 3.9348 3.9814 3.6809 3.9544 4.0642 4.2437 4.0079 3.8619 3.9023 3.9183 3.9805 3.9121 3.8680 1.0040 1.0047 1.0038 1.0047 1.0039 1.0042 1.0022 1.0078 1.0031 1.0177 1.0030 0.9920 1.0039 1.0001 0.9950 1.0123 0.9942 0.9893 1.0050 0.9942 0.9992 0.9917
dispcorr: -0.023382487 hartree
energy: -1357.438315932051
dipole: -19.73253 19.23231 -0.50022 -9.44800 11.11039 1.66239 12.79890 -13.42093 -0.62202
magnitude: 1.84409 au
magnitude: 4.68731 debye
