program: Orca
programVersion: 5.0.2
elementType: S O O N N C C C C C C C C C C C C C C C C C C H H H H H H H H H H H H H H H H H H H H H H
charge: 0
multiplicity: 1
keywords: wb97x-d3
keywords: def2-TZVPP
keywords: def2/J RIJCOSX
keywords: DEFGRID2
keywords: scfconv7
keywords: smallprint printgap noloewdin
keywords: NOSOSCF
formula: C18H22N2O2S
InChI: InChI=1/C18H22N2O2S/c1-18(2,3)13-8-6-9-14(12-13)22-17(23)20(4)15-10-7-11-16(19-15)21-5/h6-12H,1-5H3
45 atoms
S  2.691036 -1.529524 0.922388
O  1.139308 -0.430603 -0.906566
O  -1.532927 3.167874 -0.595191
N  2.482358 0.994695 0.121591
N  0.475559 2.129404 -0.255287
C  -2.605718 -2.321364 1.645259
C  -1.732321 -2.306657 0.394642
C  -3.189282 -0.923731 1.886071
C  -1.741846 -2.726303 2.846306
C  -3.765524 -3.307936 1.526235
C  -0.669248 -1.407247 0.319619
C  -1.940461 -3.16015 -0.68755
C  0.150512 -1.380846 -0.794497
C  -1.113596 -3.117766 -1.802609
C  -0.052797 -2.228947 -1.868105
C  2.068932 -0.279085 0.045763
C  1.772528 2.046488 -0.51811
C  3.654598 1.324865 0.91798
C  2.443422 2.936758 -1.331993
C  1.699788 3.974255 -1.890945
C  -0.221061 3.091505 -0.817393
C  0.348741 4.06544 -1.645732
C  -2.151054 2.11642 0.135036
H  -2.413862 -0.173716 2.047857
H  -3.80337 -0.596453 1.044479
H  -3.823134 -0.927477 2.775605
H  -2.343665 -2.756169 3.757417
H  -1.304813 -3.716663 2.704764
H  -0.923747 -2.024608 3.016933
H  -3.423804 -4.337284 1.402929
H  -4.369901 -3.27591 2.434496
H  -4.425012 -3.068376 0.68983
H  -0.479355 -0.71418 1.130516
H  -2.754831 -3.871067 -0.677821
H  -1.297899 -3.789813 -2.630775
H  0.596143 -2.189634 -2.733473
H  3.510418 1.016862 1.952377
H  3.80559 2.399642 0.895986
H  4.544955 0.833121 0.529082
H  3.499796 2.830049 -1.534902
H  2.183165 4.697771 -2.533845
H  -0.257575 4.850136 -2.077092
H  -1.778046 2.057206 1.15821
H  -2.01135 1.151616 -0.35499
H  -3.21259 2.352787 0.15726
elementType: S O N C H
totalener: -1357.41552435 hartree
nucrepener: 2132.38811740 hartree
electener: -3489.80364176 hartree
oneelecener: -6092.61311847 hartree
twoeener: 2602.80947672 hartree
cpcmener: -0.02362462 hartree
kineticenergy: 1352.49801154 hartree
xcener: -113.283433003200 hartree
chargesum: -0.0000000
charge: -0.411368 -0.282044 -0.312476 -0.044521 -0.389773 0.350910 0.001395 -0.351013 -0.324618 -0.355477 -0.249661 -0.208177 0.240303 -0.123738 -0.247319 0.271380 0.207037 -0.155363 -0.225911 -0.083370 0.387035 -0.220586 -0.118480 0.088577 0.104612 0.104847 0.097968 0.103710 0.092496 0.099906 0.099811 0.103025 0.135675 0.142909 0.154059 0.146505 0.110174 0.112510 0.119848 0.162384 0.161882 0.149179 0.109340 0.112673 0.133744
qa: -0.4114 -0.2820 -0.3125 -0.0445 -0.3898 0.3509 0.0014 -0.3510 -0.3246 -0.3555 -0.2497 -0.2082 0.2403 -0.1237 -0.2473 0.2714 0.2070 -0.1554 -0.2259 -0.0834 0.3870 -0.2206 -0.1185 0.0886 0.1046 0.1048 0.0980 0.1037 0.0925 0.0999 0.0998 0.1030 0.1357 0.1429 0.1541 0.1465 0.1102 0.1125 0.1198 0.1624 0.1619 0.1492 0.1093 0.1127 0.1337
va: 2.0050 2.0910 2.1007 3.2384 3.0012 3.5978 3.6347 3.9296 3.9209 3.9267 4.0264 3.9096 3.6905 3.9340 4.0670 4.2564 3.9965 3.8600 3.9056 3.9223 3.9760 3.9124 3.8705 1.0034 1.0006 1.0080 1.0042 1.0041 1.0059 1.0006 1.0074 1.0004 1.0155 1.0004 0.9918 1.0044 1.0082 1.0008 0.9985 0.9952 0.9891 1.0047 0.9954 0.9865 0.9946
dispcorr: -0.024243921 hartree
energy: -1357.439768274291
dipole: -20.29342 19.78784 -0.50558 -7.69693 9.55475 1.85782 12.46476 -12.96809 -0.50333
magnitude: 1.99009 au
magnitude: 5.05840 debye
