program: Orca
programVersion: 5.0.2
elementType: S O O N N C C C C C C C C C C C C C C C C C C H H H H H H H H H H H H H H H H H H H H H H
charge: 0
multiplicity: 1
keywords: wb97x-d3
keywords: def2-TZVPP
keywords: def2/J RIJCOSX
keywords: DEFGRID2
keywords: scfconv7
keywords: smallprint printgap noloewdin
keywords: NOSOSCF
formula: C18H22N2O2S
InChI: InChI=1/C18H22N2O2S/c1-18(2,3)13-8-6-9-14(12-13)22-17(23)20(4)15-10-7-11-16(19-15)21-5/h6-12H,1-5H3
45 atoms
S  2.133492 -1.772005 -1.540704
O  1.160143 -0.15073 0.301954
O  -1.457136 3.494631 -0.156923
N  2.1503 0.878659 -1.383309
N  0.353331 2.233312 -0.755677
C  -3.064908 -2.629766 0.833153
C  -1.594899 -2.389519 1.162315
C  -3.899311 -2.507222 2.113666
C  -3.225589 -4.041093 0.254506
C  -3.602667 -1.62718 -0.186729
C  -0.84875 -1.389667 0.546702
C  -0.950047 -3.18867 2.111083
C  0.483453 -1.2057 0.881603
C  0.380959 -2.988361 2.438747
C  1.119098 -1.985746 1.823947
C  1.792589 -0.30738 -0.862821
C  1.669601 2.106444 -0.855922
C  3.031347 0.916689 -2.540893
C  2.558537 3.108484 -0.521843
C  2.02257 4.311595 -0.066979
C  -0.137645 3.361011 -0.293989
C  0.659805 4.456315 0.05871
C  -2.278356 2.365732 -0.421973
H  -4.954919 -2.685025 1.896621
H  -3.598362 -3.229165 2.874052
H  -3.813679 -1.510213 2.550331
H  -4.271646 -4.234599 0.006785
H  -2.640249 -4.164995 -0.658602
H  -2.909097 -4.81183 0.959003
H  -4.657715 -1.829935 -0.37871
H  -3.531093 -0.595924 0.1670
H  -3.083207 -1.691732 -1.144803
H  -1.286965 -0.736887 -0.197099
H  -1.492383 -3.981267 2.611238
H  0.852382 -3.620287 3.180354
H  2.159097 -1.819159 2.072519
H  4.008976 0.497827 -2.306089
H  3.155912 1.948198 -2.855977
H  2.600368 0.353492 -3.366661
H  3.626846 2.964141 -0.60387
H  2.680675 5.127407 0.20139
H  0.213949 5.373418 0.41865
H  -2.057468 1.541581 0.25864
H  -2.18036 2.015269 -1.450163
H  -3.300927 2.697335 -0.25647
elementType: S O N C H
totalener: -1357.41600337 hartree
nucrepener: 2103.40816670 hartree
electener: -3460.82417008 hartree
oneelecener: -6034.78595659 hartree
twoeener: 2573.96178651 hartree
cpcmener: -0.02433589 hartree
kineticenergy: 1352.49760630 hartree
xcener: -113.281939372867 hartree
chargesum: 0.0000000
charge: -0.425466 -0.272374 -0.312718 -0.053151 -0.384882 0.319181 -0.045296 -0.321859 -0.324416 -0.359548 -0.186998 -0.206477 0.227811 -0.163026 -0.191619 0.283705 0.202183 -0.158855 -0.230940 -0.081586 0.386730 -0.220482 -0.107720 0.096360 0.096126 0.102113 0.096386 0.103032 0.096681 0.102122 0.096994 0.104164 0.135918 0.139534 0.154706 0.145701 0.120750 0.112707 0.109258 0.162691 0.161748 0.148036 0.102308 0.108497 0.131972
qa: -0.4255 -0.2724 -0.3127 -0.0532 -0.3849 0.3192 -0.0453 -0.3219 -0.3244 -0.3595 -0.1870 -0.2065 0.2278 -0.1630 -0.1916 0.2837 0.2022 -0.1589 -0.2309 -0.0816 0.3867 -0.2205 -0.1077 0.0964 0.0961 0.1021 0.0964 0.1030 0.0967 0.1021 0.0970 0.1042 0.1359 0.1395 0.1547 0.1457 0.1208 0.1127 0.1093 0.1627 0.1617 0.1480 0.1023 0.1085 0.1320
va: 1.9831 2.1244 2.0987 3.2262 2.9991 3.6186 3.6879 3.9187 3.9189 3.9290 4.0175 3.9640 3.7449 3.9529 4.0536 4.2323 4.0108 3.8590 3.9069 3.9201 3.9797 3.9067 3.8583 1.0039 1.0050 1.0030 1.0038 1.0041 1.0043 1.0087 1.0035 0.9994 1.0133 1.0036 0.9916 1.0026 0.9973 1.0007 1.0097 0.9951 0.9892 1.0055 0.9967 0.9971 0.9944
dispcorr: -0.022929450 hartree
energy: -1357.438932824459
dipole: -23.22913 22.95620 -0.27294 -10.51702 12.24252 1.72550 3.47186 -3.04446 0.42740
magnitude: 1.79848 au
magnitude: 4.57137 debye
