program: Orca
programVersion: 5.0.2
elementType: S O O N N C C C C C C C C C C C C C C C C C C H H H H H H H H H H H H H H H H H H H H H H
charge: 0
multiplicity: 1
keywords: wb97x-d3
keywords: def2-TZVPP
keywords: def2/J RIJCOSX
keywords: DEFGRID2
keywords: scfconv7
keywords: smallprint printgap noloewdin
keywords: NOSOSCF
formula: C18H22N2O2S
InChI: InChI=1/C18H22N2O2S/c1-18(2,3)13-8-6-9-14(12-13)22-17(23)20(4)15-10-7-11-16(19-15)21-5/h6-12H,1-5H3
45 atoms
S  2.163261 -0.727614 1.816374
O  0.445322 0.060303 -0.027263
O  -0.880979 4.233402 -1.192179
N  2.368912 1.145723 -0.055685
N  0.738498 2.706084 -0.668263
C  -1.944707 -4.192319 0.408367
C  -1.78418 -2.725649 0.794845
C  -0.686648 -4.960439 0.833579
C  -2.121078 -4.301482 -1.110985
C  -3.154254 -4.839132 1.080442
C  -0.734128 -1.9875 0.244237
C  -2.632808 -2.077935 1.689259
C  -0.555124 -0.66434 0.590033
C  -2.441421 -0.742207 2.025052
C  -1.395122 -0.018095 1.480619
C  1.639757 0.19614 0.553769
C  1.809998 2.013675 -1.031678
C  3.776905 1.298369 0.280961
C  2.415072 2.139105 -2.266367
C  1.86142 3.054022 -3.159375
C  0.209118 3.544611 -1.530706
C  0.741329 3.771342 -2.805832
C  -1.473087 3.978943 0.073361
H  -0.774956 -6.015661 0.565546
H  0.213345 -4.576238 0.350789
H  -0.53319 -4.903585 1.913149
H  -2.242688 -5.346105 -1.405794
H  -3.004759 -3.756362 -1.448563
H  -1.260846 -3.908926 -1.655277
H  -3.228495 -5.884316 0.774927
H  -3.078859 -4.826584 2.169462
H  -4.091188 -4.353053 0.801273
H  -0.044675 -2.440485 -0.45775
H  -3.462094 -2.605752 2.139117
H  -3.117933 -0.263279 2.721163
H  -1.235465 1.022398 1.734971
H  4.168895 2.172614 -0.230356
H  4.353257 0.423978 -0.019921
H  3.898211 1.443115 1.353021
H  3.281088 1.548126 -2.53076
H  2.304112 3.188988 -4.137526
H  0.282533 4.483169 -3.478516
H  -1.830548 2.950243 0.153032
H  -2.322844 4.654217 0.145042
H  -0.787022 4.181056 0.89738
elementType: S O N C H
totalener: -1357.41597853 hartree
nucrepener: 2076.62215057 hartree
electener: -3434.03812911 hartree
oneelecener: -5981.36436489 hartree
twoeener: 2547.32623578 hartree
cpcmener: -0.02415075 hartree
kineticenergy: 1352.48767432 hartree
xcener: -113.279622031380 hartree
chargesum: -0.0000000
charge: -0.424276 -0.275030 -0.310658 -0.053002 -0.382782 0.330485 -0.055649 -0.323576 -0.327580 -0.355079 -0.184099 -0.183636 0.199099 -0.152289 -0.201773 0.282690 0.199626 -0.160839 -0.229322 -0.083639 0.385574 -0.216020 -0.112715 0.096647 0.095352 0.102882 0.097059 0.102761 0.097806 0.099793 0.100700 0.102431 0.128890 0.143442 0.155234 0.153643 0.113791 0.122027 0.108665 0.162101 0.161496 0.148418 0.104503 0.129925 0.106923
qa: -0.4243 -0.2750 -0.3107 -0.0530 -0.3828 0.3305 -0.0556 -0.3236 -0.3276 -0.3551 -0.1841 -0.1836 0.1991 -0.1523 -0.2018 0.2827 0.1996 -0.1608 -0.2293 -0.0836 0.3856 -0.2160 -0.1127 0.0966 0.0954 0.1029 0.0971 0.1028 0.0978 0.0998 0.1007 0.1024 0.1289 0.1434 0.1552 0.1536 0.1138 0.1220 0.1087 0.1621 0.1615 0.1484 0.1045 0.1299 0.1069
va: 1.9840 2.1212 2.0963 3.2231 2.9964 3.6246 3.7011 3.9194 3.9187 3.9245 4.1471 3.8941 3.7534 3.9602 4.0128 4.2355 4.0147 3.8600 3.9053 3.9212 3.9805 3.9046 3.8614 1.0042 1.0047 1.0041 1.0033 1.0038 1.0036 1.0074 1.0005 1.0005 1.0167 1.0006 0.9941 0.9993 1.0001 0.9960 1.0109 0.9951 0.9892 1.0050 0.9925 0.9951 0.9978
dispcorr: -0.022056820 hartree
energy: -1357.438035352052
dipole: -12.76714 12.68070 -0.08644 -21.17749 22.02380 0.84630 -0.16174 -1.40586 -1.56760
magnitude: 1.78356 au
magnitude: 4.53344 debye
