program: Orca
programVersion: 5.0.2
elementType: S O O N N C C C C C C C C C C C C C C C C C C H H H H H H H H H H H H H H H H H H H H H H
charge: 0
multiplicity: 1
keywords: wb97x-d3
keywords: def2-TZVPP
keywords: def2/J RIJCOSX
keywords: DEFGRID2
keywords: scfconv7
keywords: smallprint printgap noloewdin
keywords: NOSOSCF
formula: C18H22N2O2S
InChI: InChI=1/C18H22N2O2S/c1-18(2,3)13-8-6-9-14(12-13)22-17(23)20(4)15-10-7-11-16(19-15)21-5/h6-12H,1-5H3
45 atoms
S  2.193171 -1.324288 -0.515452
O  0.02978 0.029195 0.162023
O  1.10809 5.556297 0.518044
N  1.547609 1.214763 -0.931125
N  1.258382 3.392813 -0.202169
C  -2.503041 -4.191847 -0.224629
C  -1.744525 -3.14294 0.581491
C  -3.942317 -4.29064 0.297151
C  -1.803203 -5.548488 -0.069613
C  -2.556795 -3.85084 -1.713788
C  -1.161832 -2.028855 -0.008384
C  -1.610723 -3.288982 1.963943
C  -0.472326 -1.107593 0.761642
C  -0.922609 -2.36015 2.723385
C  -0.339143 -1.252772 2.125357
C  1.229866 0.000763 -0.432048
C  0.704081 2.346563 -0.796655
C  2.88017 1.423047 -1.474082
C  -0.579319 2.36131 -1.309958
C  -1.317279 3.528717 -1.147576
C  0.556588 4.496858 -0.071057
C  -0.761449 4.621046 -0.520149
C  2.442741 5.44111 0.972912
H  -4.506239 -5.030038 -0.274911
H  -3.980839 -4.591017 1.344516
H  -4.458399 -3.333588 0.209656
H  -0.778822 -5.505538 -0.441162
H  -1.762855 -5.872733 0.970512
H  -2.334609 -6.318543 -0.632589
H  -3.069174 -2.905272 -1.900427
H  -1.561482 -3.793237 -2.157592
H  -3.105353 -4.626266 -2.250364
H  -1.22654 -1.86253 -1.074473
H  -2.050662 -4.143377 2.46262
H  -0.834455 -2.498879 3.792751
H  0.204587 -0.519503 2.705361
H  3.072042 0.707918 -2.271122
H  3.644092 1.293359 -0.708698
H  2.941085 2.432082 -1.869464
H  -0.991796 1.504403 -1.820122
H  -2.328282 3.582419 -1.529057
H  -1.304962 5.544931 -0.38387
H  3.131787 5.20512 0.160744
H  2.547244 4.674183 1.741669
H  2.696886 6.411198 1.391908
totalener: -1357.39695770 hartree
nucrepener: 2046.60893027 hartree
electener: -3404.00588797 hartree
oneelecener: -5920.33459534 hartree
twoeener: 2516.32870737 hartree
kineticenergy: 1352.54899139 hartree
xcener: -113.291249867795 hartree
chargesum: -0.0000000
charge: -0.338386 -0.283540 -0.276234 -0.062846 -0.374966 0.248168 -0.016732 -0.287844 -0.288331 -0.338798 -0.123958 -0.172700 0.208487 -0.145825 -0.132404 0.244624 0.211618 -0.158958 -0.188693 -0.066853 0.355940 -0.193970 -0.116171 0.086628 0.086720 0.097996 0.105918 0.085837 0.085546 0.092319 0.100783 0.090639 0.104516 0.104580 0.120540 0.119090 0.113829 0.116589 0.089963 0.119853 0.128191 0.126850 0.097573 0.104549 0.119864
qa: -0.3384 -0.2835 -0.2762 -0.0628 -0.3750 0.2482 -0.0167 -0.2878 -0.2883 -0.3388 -0.1240 -0.1727 0.2085 -0.1458 -0.1324 0.2446 0.2116 -0.1590 -0.1887 -0.0669 0.3559 -0.1940 -0.1162 0.0866 0.0867 0.0980 0.1059 0.0858 0.0855 0.0923 0.1008 0.0906 0.1045 0.1046 0.1205 0.1191 0.1138 0.1166 0.0900 0.1199 0.1282 0.1269 0.0976 0.1045 0.1199
va: 2.0765 2.1006 2.1227 3.2100 2.9831 3.7448 3.7090 3.9219 3.9234 3.9310 4.0603 4.0253 3.8564 4.0299 4.0905 4.2507 4.0232 3.8902 3.9510 3.9504 4.0446 3.9368 3.8862 1.0068 1.0083 1.0062 1.0061 1.0082 1.0061 1.0032 1.0025 1.0121 1.0162 1.0124 1.0022 1.0066 1.0085 1.0014 1.0106 1.0144 0.9994 1.0116 0.9974 0.9982 0.9936
dispcorr: -0.021280342 hartree
energy: -1357.418238045231
dipole: -13.13864 12.39400 -0.74464 -18.87418 19.71885 0.84467 -2.09873 1.96978 -0.12895
magnitude: 1.13340 au
magnitude: 2.88087 debye
