program: Orca
programVersion: 5.0.2
elementType: S O O N N C C C C C C C C C C C C C C C C C C H H H H H H H H H H H H H H H H H H H H H H
charge: 0
multiplicity: 1
keywords: wb97x-d3
keywords: def2-TZVPP
keywords: def2/J RIJCOSX
keywords: DEFGRID2
keywords: scfconv7
keywords: smallprint printgap noloewdin
keywords: NOSOSCF
formula: C18H22N2O2S
InChI: InChI=1/C18H22N2O2S/c1-18(2,3)13-8-6-9-14(12-13)22-17(23)20(4)15-10-7-11-16(19-15)21-5/h6-12H,1-5H3
45 atoms
S  1.971287 -0.845124 1.634717
O  0.203693 -0.096701 -0.179272
O  1.388402 5.000505 -2.291787
N  1.303981 1.572667 0.771968
N  1.282952 3.28243 -0.789137
C  -2.504967 -3.967197 1.253631
C  -1.50343 -3.293125 0.322898
C  -1.816476 -5.148526 1.949681
C  -3.702147 -4.473586 0.439178
C  -3.029422 -3.016251 2.329054
C  -1.07893 -1.98419 0.508388
C  -0.963912 -4.002315 -0.752392
C  -0.149971 -1.419619 -0.349207
C  -0.042485 -3.425604 -1.606946
C  0.379601 -2.118326 -1.411817
C  1.133244 0.234152 0.726457
C  0.559113 2.472821 -0.030577
C  2.387024 2.113979 1.576528
C  -0.820325 2.532087 0.035286
C  -1.457261 3.473897 -0.765092
C  0.669596 4.178721 -1.529655
C  -0.720971 4.317016 -1.566298
C  2.796122 4.862174 -2.271037
H  -2.510407 -5.652327 2.625561
H  -1.457402 -5.889835 1.235391
H  -0.959151 -4.812656 2.534193
H  -3.408871 -5.204503 -0.314474
H  -4.431236 -4.955991 1.093111
H  -4.203912 -3.652976 -0.075091
H  -3.74774 -3.53755 2.962948
H  -2.232354 -2.650795 2.97834
H  -3.542746 -2.154656 1.898886
H  -1.453518 -1.386025 1.327025
H  -1.26643 -5.026432 -0.929962
H  0.357396 -3.999002 -2.432475
H  1.104106 -1.655088 -2.067404
H  3.352847 1.745157 1.235067
H  2.260519 1.822402 2.617373
H  2.371641 3.19641 1.497755
H  -1.38194 1.880601 0.686785
H  -2.536028 3.55176 -0.747795
H  -1.183833 5.063964 -2.194834
H  3.113371 3.872617 -2.602325
H  3.209362 5.038246 -1.276436
H  3.177334 5.614008 -2.957536
totalener: -1357.39680443 hartree
nucrepener: 2048.04081615 hartree
electener: -3405.43762057 hartree
oneelecener: -5923.18239349 hartree
twoeener: 2517.74477292 hartree
kineticenergy: 1352.55978801 hartree
xcener: -113.293263414972 hartree
chargesum: -0.0000000
charge: -0.338534 -0.283795 -0.276075 -0.059655 -0.377344 0.249188 -0.016205 -0.287112 -0.288948 -0.340733 -0.127312 -0.175776 0.215808 -0.144754 -0.136285 0.241927 0.211001 -0.156808 -0.187953 -0.067281 0.356084 -0.193880 -0.116244 0.085409 0.085684 0.105887 0.086746 0.086895 0.098103 0.091287 0.098937 0.094000 0.105236 0.105558 0.120799 0.119840 0.115568 0.113306 0.090255 0.119628 0.128208 0.127393 0.104103 0.098297 0.119544
qa: -0.3385 -0.2838 -0.2761 -0.0597 -0.3773 0.2492 -0.0162 -0.2871 -0.2889 -0.3407 -0.1273 -0.1758 0.2158 -0.1448 -0.1363 0.2419 0.2110 -0.1568 -0.1880 -0.0673 0.3561 -0.1939 -0.1162 0.0854 0.0857 0.1059 0.0867 0.0869 0.0981 0.0913 0.0989 0.0940 0.1052 0.1056 0.1208 0.1198 0.1156 0.1133 0.0903 0.1196 0.1282 0.1274 0.1041 0.0983 0.1195
va: 2.0759 2.1000 2.1228 3.2085 2.9818 3.7421 3.7114 3.9237 3.9213 3.9318 4.0613 4.0263 3.8417 4.0313 4.0948 4.2528 4.0239 3.8889 3.9513 3.9523 4.0441 3.9382 3.8865 1.0061 1.0080 1.0067 1.0085 1.0067 1.0060 1.0122 1.0023 1.0033 1.0150 1.0122 1.0021 1.0068 1.0027 1.0068 1.0114 1.0137 0.9995 1.0115 0.9989 0.9970 0.9937
dispcorr: -0.021326586 hartree
energy: -1357.418131012802
dipole: -13.87057 13.13349 -0.73708 -17.27973 18.02897 0.74924 6.19225 -6.61812 -0.42587
magnitude: 1.13403 au
magnitude: 2.88247 debye
