program: Orca
programVersion: 5.0.2
elementType: S O O N N C C C C C C C C C C C C C C C C C C H H H H H H H H H H H H H H H H H H H H H H
charge: 0
multiplicity: 1
keywords: wb97x-d3
keywords: def2-TZVPP
keywords: def2/J RIJCOSX
keywords: DEFGRID2
keywords: scfconv7
keywords: smallprint printgap noloewdin
keywords: NOSOSCF
formula: C18H22N2O2S
InChI: InChI=1/C18H22N2O2S/c1-18(2,3)13-8-6-9-14(12-13)22-17(23)20(4)15-10-7-11-16(19-15)21-5/h6-12H,1-5H3
45 atoms
S  2.105137 -0.984842 1.437955
O  0.45593 -0.246043 -0.490442
O  -0.209183 5.389324 -0.564104
N  1.835939 1.344146 0.201327
N  0.776346 3.352941 -0.244596
C  -2.557152 -3.543889 1.52643
C  -1.57195 -3.157637 0.428588
C  -1.835306 -3.49746 2.880245
C  -3.12276 -4.950446 1.330028
C  -3.729924 -2.555532 1.534507
C  -0.990881 -1.891443 0.453645
C  -1.200485 -4.020101 -0.598883
C  -0.068812 -1.522276 -0.503607
C  -0.278647 -3.634245 -1.562181
C  0.303354 -2.379893 -1.521114
C  1.453833 0.057792 0.350542
C  1.253662 2.223053 -0.746362
C  2.800419 1.899324 1.137442
C  1.255555 1.940273 -2.09961
C  0.69913 2.889545 -2.950181
C  0.265835 4.248378 -1.060343
C  0.190532 4.064706 -2.444334
C  -0.139162 5.581922 0.835846
H  -2.520296 -3.764608 3.687641
H  -0.99749 -4.195401 2.903289
H  -1.437721 -2.506305 3.100011
H  -3.82288 -5.181995 2.134087
H  -3.667187 -5.045778 0.388777
H  -2.342958 -5.713514 1.351507
H  -4.446381 -2.821503 2.314294
H  -3.406694 -1.531886 1.726144
H  -4.256357 -2.561656 0.578893
H  -1.242168 -1.183124 1.23259
H  -1.62734 -5.010899 -0.662349
H  -0.006758 -4.32445 -2.34979
H  1.030883 -2.072667 -2.260393
H  2.413148 1.887035 2.155512
H  3.013573 2.924275 0.850819
H  3.718902 1.316005 1.115697
H  1.681948 1.026621 -2.484383
H  0.678935 2.707896 -4.016561
H  -0.24181 4.82541 -3.078251
H  -0.69613 4.818172 1.38114
H  -0.582224 6.557291 1.023416
H  0.890775 5.576878 1.197479
totalener: -1357.39660926 hartree
nucrepener: 2052.40057629 hartree
electener: -3409.79718555 hartree
oneelecener: -5931.93072940 hartree
twoeener: 2522.13354386 hartree
kineticenergy: 1352.54125558 hartree
xcener: -113.290176766872 hartree
chargesum: -0.0000000
charge: -0.338635 -0.287119 -0.276051 -0.060420 -0.378526 0.253036 -0.006875 -0.280874 -0.335856 -0.292365 -0.125164 -0.162559 0.170451 -0.114245 -0.151281 0.245647 0.214903 -0.157291 -0.187885 -0.069134 0.356890 -0.194049 -0.116146 0.084787 0.101304 0.089963 0.090548 0.095785 0.094678 0.086647 0.087428 0.098356 0.102571 0.116371 0.119998 0.108875 0.115532 0.090224 0.113790 0.119371 0.128116 0.127574 0.103948 0.119849 0.097832
qa: -0.3386 -0.2871 -0.2761 -0.0604 -0.3785 0.2530 -0.0069 -0.2809 -0.3359 -0.2924 -0.1252 -0.1626 0.1705 -0.1142 -0.1513 0.2456 0.2149 -0.1573 -0.1879 -0.0691 0.3569 -0.1940 -0.1161 0.0848 0.1013 0.0900 0.0905 0.0958 0.0947 0.0866 0.0874 0.0984 0.1026 0.1164 0.1200 0.1089 0.1155 0.0902 0.1138 0.1194 0.1281 0.1276 0.1039 0.1198 0.0978
va: 2.0746 2.1038 2.1233 3.2161 2.9818 3.7567 3.7073 3.9238 3.9286 3.9233 4.1370 3.9526 3.8886 4.0076 4.0878 4.2499 4.0187 3.8876 3.9572 3.9531 4.0424 3.9381 3.8865 1.0053 1.0079 1.0098 1.0122 1.0024 1.0029 1.0066 1.0081 1.0065 1.0194 1.0080 1.0034 1.0076 1.0023 1.0114 1.0077 1.0139 0.9995 1.0114 0.9989 0.9936 0.9970
dispcorr: -0.021419431 hartree
energy: -1357.418028687336
dipole: -16.97123 16.52255 -0.44868 -13.45196 14.19676 0.74479 11.16823 -11.82017 -0.65194
magnitude: 1.08676 au
magnitude: 2.76233 debye
