program: Orca
programVersion: 5.0.2
elementType: S O O N N C C C C C C C C C C C C C C C C C C H H H H H H H H H H H H H H H H H H H H H H
charge: 0
multiplicity: 1
keywords: wb97x-d3
keywords: def2-TZVPP
keywords: def2/J RIJCOSX
keywords: DEFGRID2
keywords: scfconv7
keywords: smallprint printgap noloewdin
keywords: NOSOSCF
formula: C18H22N2O2S
InChI: InChI=1/C18H22N2O2S/c1-18(2,3)13-8-6-9-14(12-13)22-17(23)20(4)15-10-7-11-16(19-15)21-5/h6-12H,1-5H3
45 atoms
S  2.268488 -1.012726 1.3066
O  0.509876 -0.270133 -0.523644
O  -0.40839 5.274403 -0.524752
N  1.875448 1.337403 0.146929
N  0.700175 3.294872 -0.248077
C  -2.361807 -3.633844 1.587448
C  -1.446753 -3.214404 0.442319
C  -2.92574 -5.041318 1.392671
C  -3.540488 -2.658122 1.691295
C  -1.558488 -3.611816 2.895512
C  -0.869058 -1.946702 0.46524
C  -1.134327 -4.048698 -0.627123
C  -0.004295 -1.550174 -0.533827
C  -0.270103 -3.635812 -1.631497
C  0.310927 -2.380948 -1.592086
C  1.536623 0.038346 0.280532
C  1.242476 2.207778 -0.776249
C  2.859982 1.904276 1.053214
C  1.259765 1.955038 -2.134813
C  0.644205 2.885829 -2.964804
C  0.134016 4.174809 -1.0444
C  0.065408 4.015459 -2.431801
C  -0.328301 5.455049 0.875854
H  -3.576819 -5.29694 2.229746
H  -3.521818 -5.122385 0.481997
H  -2.139093 -5.796374 1.353427
H  -4.13052 -2.652935 0.773832
H  -4.200132 -2.944154 2.512771
H  -3.214607 -1.634637 1.879073
H  -2.187246 -3.914816 3.735293
H  -0.70926 -4.294051 2.845633
H  -1.165135 -2.620028 3.119676
H  -1.0784 -1.258338 1.273912
H  -1.56231 -5.038898 -0.691192
H  -0.043072 -4.304876 -2.450796
H  0.993219 -2.051511 -2.364098
H  2.983694 2.956428 0.817543
H  3.813559 1.39147 0.942593
H  2.539607 1.806403 2.088977
H  1.739763 1.075752 -2.537089
H  0.632448 2.726986 -4.034861
H  -0.415034 4.761596 -3.04835
H  -0.84031 4.660619 1.420034
H  -0.814227 6.405878 1.079524
H  0.705273 5.495437 1.223734
totalener: -1357.39653085 hartree
nucrepener: 2053.66686630 hartree
electener: -3411.06339715 hartree
oneelecener: -5934.46851076 hartree
twoeener: 2523.40511361 hartree
kineticenergy: 1352.55022543 hartree
xcener: -113.291487597109 hartree
chargesum: -0.0000000
charge: -0.338908 -0.285262 -0.275916 -0.058677 -0.377247 0.252116 -0.005664 -0.336007 -0.291745 -0.281119 -0.124706 -0.163483 0.169694 -0.114409 -0.153695 0.244053 0.210161 -0.155623 -0.189194 -0.067774 0.356155 -0.192053 -0.116551 0.090200 0.095581 0.095486 0.098107 0.086951 0.087333 0.084673 0.101764 0.089565 0.102960 0.117226 0.119956 0.109018 0.090133 0.113850 0.114516 0.120552 0.128382 0.127451 0.104470 0.119783 0.097896
qa: -0.3389 -0.2853 -0.2759 -0.0587 -0.3772 0.2521 -0.0057 -0.3360 -0.2917 -0.2811 -0.1247 -0.1635 0.1697 -0.1144 -0.1537 0.2441 0.2102 -0.1556 -0.1892 -0.0678 0.3562 -0.1921 -0.1166 0.0902 0.0956 0.0955 0.0981 0.0870 0.0873 0.0847 0.1018 0.0896 0.1030 0.1172 0.1200 0.1090 0.0901 0.1138 0.1145 0.1206 0.1284 0.1275 0.1045 0.1198 0.0979
va: 2.0752 2.1048 2.1232 3.2093 2.9835 3.7585 3.7058 3.9283 3.9230 3.9239 4.1350 3.9512 3.8898 4.0084 4.0897 4.2517 4.0196 3.8873 3.9576 3.9527 4.0427 3.9381 3.8867 1.0123 1.0022 1.0027 1.0064 1.0066 1.0082 1.0054 1.0078 1.0100 1.0195 1.0077 1.0033 1.0078 1.0118 1.0053 1.0037 1.0135 0.9994 1.0114 0.9985 0.9936 0.9974
dispcorr: -0.021425991 hartree
energy: -1357.417956838578
dipole: -16.32729 15.83149 -0.49580 -13.77696 14.55843 0.78147 11.82857 -12.45356 -0.62499
magnitude: 1.11675 au
magnitude: 2.83855 debye
