program: Orca
programVersion: 5.0.2
elementType: S O O N N C C C C C C C C C C C C C C C C C C H H H H H H H H H H H H H H H H H H H H H H
charge: 0
multiplicity: 1
keywords: wb97x-d3
keywords: def2-TZVPP
keywords: def2/J RIJCOSX
keywords: DEFGRID2
keywords: scfconv7
keywords: smallprint printgap noloewdin
keywords: NOSOSCF
formula: C18H22N2O2S
InChI: InChI=1/C18H22N2O2S/c1-18(2,3)13-8-6-9-14(12-13)22-17(23)20(4)15-10-7-11-16(19-15)21-5/h6-12H,1-5H3
45 atoms
S  1.968292 -1.768876 -1.608316
O  1.209468 -0.166081 0.351197
O  -1.45188 3.55399 -0.239534
N  2.134684 0.867439 -1.362481
N  0.346256 2.250761 -0.776135
C  -3.023353 -2.640607 0.853891
C  -1.560261 -2.389756 1.203287
C  -3.878717 -2.536109 2.122759
C  -3.161526 -4.046557 0.254919
C  -3.55782 -1.631969 -0.162915
C  -0.809437 -1.394766 0.591101
C  -0.925665 -3.181669 2.162915
C  0.519744 -1.20716 0.933198
C  0.401298 -2.9821 2.499121
C  1.144368 -1.986127 1.882236
C  1.750116 -0.32583 -0.861822
C  1.660665 2.086282 -0.813369
C  2.870547 0.9101 -2.613517
C  2.558852 3.048388 -0.395263
C  2.037643 4.250485 0.076544
C  -0.134069 3.37806 -0.303305
C  0.67579 4.434181 0.132944
C  -2.283551 2.487376 -0.654175
H  -4.930552 -2.712519 1.88882
H  -3.586969 -3.26612 2.877922
H  -3.795949 -1.545915 2.573013
H  -4.201583 -4.251005 -0.007686
H  -2.559189 -4.148829 -0.648396
H  -2.841342 -4.820288 0.953321
H  -4.607405 -1.841701 -0.373741
H  -3.501191 -0.607239 0.210373
H  -3.02172 -1.680265 -1.112082
H  -1.235833 -0.749935 -0.164989
H  -1.473942 -3.971016 2.661299
H  0.866605 -3.611744 3.245821
H  2.184503 -1.823184 2.128805
H  3.763883 0.290747 -2.555456
H  3.15735 1.939186 -2.814236
H  2.259517 0.542998 -3.438905
H  3.623517 2.865068 -0.422828
H  2.703408 5.034636 0.411671
H  0.233523 5.349256 0.499875
H  -2.131648 1.595191 -0.043402
H  -2.116655 2.220374 -1.698641
H  -3.304091 2.840659 -0.52898
totalener: -1357.39475524 hartree
nucrepener: 2104.76334255 hartree
electener: -3462.15809779 hartree
oneelecener: -6036.67280324 hartree
twoeener: 2574.51470545 hartree
kineticenergy: 1352.54999894 hartree
xcener: -113.289783822675 hartree
chargesum: 0.0000000
charge: -0.341261 -0.271385 -0.277880 -0.081597 -0.350381 0.244991 -0.008204 -0.287830 -0.288345 -0.344611 -0.109596 -0.176177 0.181962 -0.141184 -0.127279 0.247548 0.197472 -0.163499 -0.211478 -0.062615 0.357160 -0.190508 -0.103731 0.086136 0.086999 0.098144 0.085137 0.105797 0.086679 0.092803 0.085786 0.103642 0.105722 0.104615 0.120337 0.114978 0.114400 0.092914 0.117537 0.136176 0.130499 0.127346 0.084551 0.105690 0.122542
qa: -0.3413 -0.2714 -0.2779 -0.0816 -0.3504 0.2450 -0.0082 -0.2878 -0.2883 -0.3446 -0.1096 -0.1762 0.1820 -0.1412 -0.1273 0.2475 0.1975 -0.1635 -0.2115 -0.0626 0.3572 -0.1905 -0.1037 0.0861 0.0870 0.0981 0.0851 0.1058 0.0867 0.0928 0.0858 0.1036 0.1057 0.1046 0.1203 0.1150 0.1144 0.0929 0.1175 0.1362 0.1305 0.1273 0.0846 0.1057 0.1225
va: 2.0739 2.1165 2.1306 3.1895 3.0221 3.7431 3.6926 3.9210 3.9222 3.9300 4.0143 4.0239 3.9073 4.0291 4.0918 4.2694 4.0261 3.8812 3.9377 3.9505 4.0444 3.9331 3.8861 1.0069 1.0089 1.0058 1.0060 1.0065 1.0080 1.0137 1.0062 0.9997 1.0210 1.0120 1.0017 1.0093 1.0046 1.0008 1.0046 1.0057 0.9988 1.0123 1.0055 0.9989 0.9947
dispcorr: -0.022812932 hartree
energy: -1357.417568175732
dipole: -23.08553 22.85452 -0.23101 -10.46615 11.66297 1.19682 3.02055 -2.71743 0.30312
magnitude: 1.25603 au
magnitude: 3.19258 debye
