program: Orca
programVersion: 5.0.2
elementType: S O O N N C C C C C C C C C C C C C C C C C C H H H H H H H H H H H H H H H H H H H H H H
charge: 0
multiplicity: 1
keywords: wb97x-d3
keywords: def2-TZVPP
keywords: def2/J RIJCOSX
keywords: DEFGRID2
keywords: scfconv7
keywords: smallprint printgap noloewdin
keywords: NOSOSCF
formula: C18H22N2O2S
InChI: InChI=1/C18H22N2O2S/c1-18(2,3)13-8-6-9-14(12-13)22-17(23)20(4)15-10-7-11-16(19-15)21-5/h6-12H,1-5H3
45 atoms
S  2.283694 -0.624876 1.875774
O  0.642016 -0.091438 -0.121546
O  -0.984631 4.051797 -1.209682
N  2.449865 1.177135 -0.061881
N  0.725526 2.632292 -0.675507
C  -2.014676 -4.170435 0.386558
C  -1.746117 -2.717558 0.763914
C  -0.800144 -5.021472 0.78072
C  -2.246888 -4.27267 -1.126158
C  -3.244843 -4.735733 1.096098
C  -0.667837 -2.048007 0.18182
C  -2.517582 -2.02128 1.687241
C  -0.38667 -0.74285 0.522274
C  -2.223289 -0.705504 2.023701
C  -1.152805 -0.05152 1.446003
C  1.767785 0.18441 0.547277
C  1.842443 2.014095 -1.031827
C  3.781897 1.510688 0.410383
C  2.447899 2.189411 -2.260848
C  1.848138 3.075168 -3.152002
C  0.151041 3.440466 -1.537431
C  0.68227 3.715735 -2.804068
C  -1.563729 3.749405 0.046161
H  -0.96929 -6.069982 0.527108
H  0.108431 -4.702549 0.269407
H  -0.609994 -4.96022 1.852905
H  -2.440195 -5.308048 -1.413504
H  -3.104423 -3.673138 -1.434305
H  -1.384024 -3.932292 -1.699062
H  -3.399971 -5.77238 0.7941
H  -3.131812 -4.7298 2.181385
H  -4.152906 -4.184948 0.84483
H  -0.029726 -2.54271 -0.539325
H  -3.362754 -2.496709 2.163962
H  -2.837925 -0.189557 2.749472
H  -0.905939 0.970399 1.701837
H  4.185017 2.304909 -0.21169
H  4.438829 0.644101 0.36293
H  3.749886 1.850959 1.445274
H  3.346616 1.648941 -2.520887
H  2.290505 3.246342 -4.124249
H  0.181782 4.402931 -3.47091
H  -1.826845 2.69317 0.125395
H  -2.466698 4.351687 0.108374
H  -0.899907 4.003846 0.873934
totalener: -1357.39439695 hartree
nucrepener: 2081.30100282 hartree
electener: -3438.69539977 hartree
oneelecener: -5989.80051609 hartree
twoeener: 2551.10511632 hartree
kineticenergy: 1352.55163347 hartree
xcener: -113.290663287224 hartree
chargesum: -0.0000000
charge: -0.336977 -0.275221 -0.276029 -0.073854 -0.352794 0.253441 -0.014664 -0.286721 -0.293110 -0.333901 -0.128601 -0.151995 0.159521 -0.118531 -0.153287 0.241016 0.204420 -0.165844 -0.216178 -0.064063 0.359032 -0.193474 -0.125659 0.084273 0.090558 0.103129 0.086672 0.098603 0.088226 0.090139 0.094902 0.095307 0.095076 0.114808 0.119308 0.131291 0.093874 0.116010 0.116428 0.136631 0.130577 0.128001 0.102691 0.121571 0.105398
qa: -0.3370 -0.2752 -0.2760 -0.0739 -0.3528 0.2534 -0.0147 -0.2867 -0.2931 -0.3339 -0.1286 -0.1520 0.1595 -0.1185 -0.1533 0.2410 0.2044 -0.1658 -0.2162 -0.0641 0.3590 -0.1935 -0.1257 0.0843 0.0906 0.1031 0.0867 0.0986 0.0882 0.0901 0.0949 0.0953 0.0951 0.1148 0.1193 0.1313 0.0939 0.1160 0.1164 0.1366 0.1306 0.1280 0.1027 0.1216 0.1054
va: 2.0804 2.1060 2.1270 3.1954 3.0197 3.7520 3.7089 3.9256 3.9231 3.9270 4.1705 3.9459 3.9316 4.0103 4.0220 4.2787 4.0252 3.8819 3.9292 3.9493 4.0481 3.9340 3.8830 1.0053 1.0073 1.0070 1.0065 1.0064 1.0076 1.0121 1.0029 1.0027 1.0260 1.0081 1.0050 1.0047 1.0008 1.0025 1.0066 1.0045 0.9988 1.0119 0.9954 0.9968 0.9969
dispcorr: -0.022253523 hartree
energy: -1357.416650471494
dipole: -14.10133 13.90118 -0.20014 -20.62841 21.31463 0.68622 0.17031 -1.18729 -1.01698
magnitude: 1.24306 au
magnitude: 3.15962 debye
