program: Orca
programVersion: 5.0.2
elementType: O O C C C C C C C C C H H H H H H H H H H H H H H H H H H
charge: 0
multiplicity: 1
keywords: wb97x-d3
keywords: def2-TZVPP
keywords: def2/J RIJCOSX
keywords: DEFGRID2
keywords: scfconv7
keywords: smallprint printgap noloewdin
keywords: NOSOSCF
formula: C9H18O2
InChI: InChI=1/C9H18O2/c1-2-3-4-5-6-7-8-9(10)11/h10H,2-8H2,1H3
29 atoms
O  -2.261432 -2.664508 -0.299103
O  -3.497078 -0.989159 -1.094062
C  0.526004 0.653855 0.098705
C  1.634942 1.003036 -0.88666
C  -0.849928 1.082028 -0.397325
C  3.021997 0.525943 -0.469174
C  -1.979589 0.834166 0.597987
C  3.574338 1.204308 0.778953
C  -2.226271 -0.636855 0.915029
C  4.99655 0.769332 1.096361
C  -2.724638 -1.418366 -0.266401
H  0.542616 -0.425893 0.279842
H  0.717997 1.12808 1.066516
H  1.38928 0.567402 -1.860449
H  1.656819 2.087947 -1.038683
H  -0.825311 2.151225 -0.629409
H  -1.067778 0.578691 -1.34571
H  3.001365 -0.558437 -0.312899
H  3.718118 0.696845 -1.296687
H  -2.902234 1.285962 0.228163
H  -1.74883 1.345351 1.53587
H  2.933152 0.992847 1.638907
H  3.546678 2.289825 0.639723
H  -3.000576 -0.718092 1.685594
H  -1.337487 -1.110337 1.332121
H  5.675241 1.003323 0.273813
H  5.052658 -0.307093 1.270028
H  5.379291 1.265628 1.989263
H  -2.643359 -3.140477 -1.053819
elementType: O C H
totalener: -504.35114990 hartree
nucrepener: 622.74775832 hartree
electener: -1127.09890822 hartree
oneelecener: -1918.46707139 hartree
twoeener: 791.36816317 hartree
cpcmener: -0.02113822 hartree
kineticenergy: 501.95021801 hartree
xcener: -49.762989674039 hartree
chargesum: 0.0000000
charge: -0.309672 -0.489746 -0.119131 -0.126623 -0.136553 -0.129673 -0.140316 -0.077090 -0.140108 -0.285238 0.422259 0.064577 0.065755 0.071767 0.062278 0.077765 0.064397 0.058588 0.069802 0.080900 0.078455 0.056331 0.055311 0.120990 0.093677 0.077984 0.078496 0.089404 0.265413
qa: -0.3097 -0.4897 -0.1191 -0.1266 -0.1366 -0.1297 -0.1403 -0.0771 -0.1401 -0.2852 0.4223 0.0646 0.0658 0.0718 0.0623 0.0778 0.0644 0.0586 0.0698 0.0809 0.0785 0.0563 0.0553 0.1210 0.0937 0.0780 0.0785 0.0894 0.2654
va: 2.1717 1.9934 3.8433 3.8989 3.8737 3.8951 3.9052 3.8527 3.8415 3.9493 4.1593 1.0084 1.0079 1.0096 1.0100 1.0096 1.0190 1.0092 1.0094 1.0225 1.0133 1.0075 1.0067 1.0080 1.0169 1.0013 1.0000 1.0035 0.9869
dispcorr: -0.009970667 hartree
energy: -504.361120571874
dipole: 18.77507 -18.15939 0.61568 8.62057 -9.02678 -0.40621 4.13358 -3.46236 0.67123
magnitude: 0.99730 au
magnitude: 2.53494 debye
