program: Orca
programVersion: 5.0.2
elementType: O O C C C C C C C C C H H H H H H H H H H H H H H H H H H
charge: 0
multiplicity: 1
keywords: wb97x-d3
keywords: def2-TZVPP
keywords: def2/J RIJCOSX
keywords: DEFGRID2
keywords: scfconv7
keywords: smallprint printgap noloewdin
keywords: NOSOSCF
formula: C9H18O2
InChI: InChI=1/C9H18O2/c1-2-3-4-5-6-7-8-9(10)11/h10H,2-8H2,1H3
29 atoms
O  -0.732286 -2.165366 -0.736977
O  -2.038186 -1.979619 1.059463
C  -0.013089 1.738315 -0.621426
C  1.361592 2.269479 -0.221097
C  -0.873301 1.31224 0.562791
C  2.26679 1.263272 0.4864
C  -2.275512 0.852584 0.175202
C  2.60579 0.034056 -0.348289
C  -2.302515 -0.389922 -0.716223
C  3.565648 -0.908249 0.362088
C  -1.692765 -1.577473 -0.028982
H  -0.542417 2.519159 -1.176889
H  0.105123 0.90648 -1.32106
H  1.873774 2.632698 -1.117582
H  1.228855 3.142953 0.425053
H  -0.371792 0.520638 1.129326
H  -0.964655 2.154869 1.254782
H  3.197411 1.769165 0.7627
H  1.812765 0.945297 1.430383
H  -2.791034 1.656722 -0.354975
H  -2.859657 0.658302 1.077144
H  3.042456 0.353494 -1.299972
H  1.693112 -0.512129 -0.601636
H  -1.811492 -0.202578 -1.670106
H  -3.341367 -0.647877 -0.94041
H  3.805652 -1.776625 -0.253047
H  3.137688 -1.277279 1.296303
H  4.505388 -0.409279 0.60682
H  -0.386399 -2.933624 -0.255391
elementType: O C H
totalener: -504.35011121 hartree
nucrepener: 654.34746232 hartree
electener: -1158.69757353 hartree
oneelecener: -1981.59825686 hartree
twoeener: 822.90068333 hartree
cpcmener: -0.02085615 hartree
kineticenergy: 501.94920379 hartree
xcener: -49.764593098694 hartree
chargesum: -0.0000000
charge: -0.304651 -0.489697 -0.140588 -0.150911 -0.128814 -0.134196 -0.145407 -0.080172 -0.135102 -0.283410 0.421414 0.079164 0.069772 0.073578 0.071825 0.066360 0.081505 0.075028 0.065619 0.079146 0.083302 0.059916 0.045730 0.092130 0.116687 0.089794 0.078452 0.079118 0.264408
qa: -0.3047 -0.4897 -0.1406 -0.1509 -0.1288 -0.1342 -0.1454 -0.0802 -0.1351 -0.2834 0.4214 0.0792 0.0698 0.0736 0.0718 0.0664 0.0815 0.0750 0.0656 0.0791 0.0833 0.0599 0.0457 0.0921 0.1167 0.0898 0.0785 0.0791 0.2644
va: 2.1716 1.9966 3.8517 3.9180 3.8437 3.8666 3.9224 3.8465 3.8489 3.9465 4.1455 1.0130 1.0010 1.0081 1.0095 1.0152 1.0100 1.0096 1.0026 1.0128 1.0201 1.0090 1.0167 1.0164 1.0100 1.0035 1.0007 1.0019 0.9880
dispcorr: -0.011547622 hartree
energy: -504.361658830605
dipole: 10.71578 -10.37977 0.33601 9.01819 -8.68842 0.32977 -0.93551 0.02239 -0.91312
magnitude: 1.02734 au
magnitude: 2.61130 debye
