program: Orca
programVersion: 5.0.2
elementType: O O C C C C C C C C C H H H H H H H H H H H H H H H H H H
charge: 0
multiplicity: 1
keywords: wb97x-d3
keywords: def2-TZVPP
keywords: def2/J RIJCOSX
keywords: DEFGRID2
keywords: scfconv7
keywords: smallprint printgap noloewdin
keywords: NOSOSCF
formula: C9H18O2
InChI: InChI=1/C9H18O2/c1-2-3-4-5-6-7-8-9(10)11/h10H,2-8H2,1H3
29 atoms
O  -2.172872 -2.076358 -0.976919
O  -0.717071 -2.131597 0.709812
C  -0.043637 1.648914 0.651561
C  1.320438 2.256823 0.332201
C  -0.828258 1.223491 -0.584752
C  2.285877 1.337107 -0.411948
C  -2.263342 0.797694 -0.291023
C  2.62831 0.054688 0.3365
C  -2.389291 -0.39737 0.660463
C  3.669819 -0.782988 -0.389354
C  -1.664115 -1.612323 0.162665
H  0.081124 0.799781 1.32911
H  -0.632087 2.387099 1.206241
H  1.171667 3.165979 -0.258827
H  1.790024 2.57818 1.267216
H  -0.858117 2.058239 -1.291737
H  -0.303393 0.416256 -1.106968
H  1.880298 1.083801 -1.396719
H  3.210447 1.889861 -0.607247
H  -2.776811 0.573531 -1.228129
H  -2.805272 1.632469 0.159454
H  1.726499 -0.545782 0.484813
H  2.993087 0.305931 1.337636
H  -3.446173 -0.648284 0.781433
H  -2.001545 -0.150061 1.647558
H  3.904027 -1.697118 0.157984
H  4.602432 -0.230912 -0.521245
H  3.319512 -1.075363 -1.381279
H  -1.670153 -2.849729 -1.277316
elementType: O C H
totalener: -504.35011744 hartree
nucrepener: 653.07983676 hartree
electener: -1157.42995420 hartree
oneelecener: -1979.36565297 hartree
twoeener: 821.93569878 hartree
cpcmener: -0.02047980 hartree
kineticenergy: 501.94470504 hartree
xcener: -49.763804467217 hartree
chargesum: -0.0000000
charge: -0.308724 -0.480892 -0.131718 -0.156295 -0.129194 -0.132242 -0.155798 -0.077297 -0.130578 -0.282502 0.415003 0.064871 0.079828 0.071676 0.073399 0.081272 0.067032 0.066331 0.074207 0.088958 0.080130 0.044256 0.059517 0.118094 0.091181 0.089831 0.079038 0.077950 0.262666
qa: -0.3087 -0.4809 -0.1317 -0.1563 -0.1292 -0.1322 -0.1558 -0.0773 -0.1306 -0.2825 0.4150 0.0649 0.0798 0.0717 0.0734 0.0813 0.0670 0.0663 0.0742 0.0890 0.0801 0.0443 0.0595 0.1181 0.0912 0.0898 0.0790 0.0779 0.2627
va: 2.1668 1.9896 3.8431 3.9238 3.8437 3.8623 3.9130 3.8477 3.8322 3.9478 4.1481 1.0079 1.0129 1.0092 1.0079 1.0102 1.0102 1.0023 1.0098 1.0154 1.0098 1.0167 1.0089 1.0148 1.0175 1.0035 1.0018 1.0007 0.9890
dispcorr: -0.011510118 hartree
energy: -504.361627559611
dipole: 9.87122 -10.68989 -0.81868 9.37330 -8.90799 0.46531 -0.72551 0.12380 -0.60171
magnitude: 1.11750 au
magnitude: 2.84045 debye
